2-Butene, 1-chloro-2-methyl-
- Formula: C5H9Cl
- Molecular weight: 104.578
- IUPAC Standard InChIKey: ZAJKEDQTROWDDD-HWKANZROSA-N
- CAS Registry Number: 13417-43-1
- Chemical structure:
View 3d structure (requires JavaScript / HTML 5) - Stereoisomers:
- Other names: 1-Chloro-2-methyl-2-butene

Reaction thermochemistry data

Data compiled by: Hussein Y. Afeefy, Joel F. Liebman, and Stephen E. Stein
Individual Reactions
By formula: C5H9Cl = C5H9Cl
Quantity | Value | Units | Method | Reference | Comment |
---|---|---|---|---|---|
ΔrH° | -2.0 ± 1.3 | kJ/mol | Eqk | Meged, Levanova, et al., 1978 | gas phase; UV Irradiation |
By formula: C5H10Cl2 = C5H9Cl + HCl
Quantity | Value | Units | Method | Reference | Comment |
---|---|---|---|---|---|
ΔrH° | 68.2 ± 4.2 | kJ/mol | Eqk | Meged, Levanova, et al., 1980 | gas phase |

Normal alkane RI, non-polar column, temperature ramp

Column type | Active phase | I | Reference | Comment |
---|---|---|---|---|
Capillary | OV-101 | 755. | Zenkevich, 2005 | 25. m/0.20 mm/0.10 μm, N2/He, 6. K/min; Tstart: 50. C; Tend: 250. C |

References

Meged, Levanova, et al., 1978
Meged, V.M.; Levanova, S.V.; Shevtsova, L.A.; Rozhnov, A.M.; Kudryavtseva, T.A.,
The allyl rearrangement of chloromethylbutenes,
Russ. J. Phys. Chem. (Engl. Transl.), 1978, 52, 286. [all data]
Meged, Levanova, et al., 1980
Meged, V.M.; Levanova, S.V.; Rozhnov, A.M.,
Dehydrohalogenation of dihalomethylbutanes. 2.,
Izv. Vyssh. Uchebn. Zaved., Khim. Khim. Tekhnol., 1980, 23, 149-151. [all data]
Zenkevich, 2005
Zenkevich, I.G.,
Experimentally measured retention indices., 2005. [all data]