Oxirane, (chloromethyl)-
- Formula: C3H5ClO
- Molecular weight: 92.524
- IUPAC Standard InChIKey: BRLQWZUYTZBJKN-UHFFFAOYSA-N
- CAS Registry Number: 13403-37-7
- Chemical structure:
View 3d structure (requires JavaScript / HTML 5) - Species with the same structure:
- Stereoisomers:
- Other names: Propane, 1-chloro-2,3-epoxy-; α-Epichlorohydrin; γ-Chloropropylene oxide; (Chloromethyl)ethylene oxide; (Chloromethyl)oxirane; Chloropropylene oxide; Epichlorohydrin; Glycerol epichlorohydrin; Glycidyl chloride; SKEkhG; 1-Chloro-2,3-Epoxypropane; 1,2-Epoxy-3-chloropropane; 2-(Chloromethyl)oxirane; 2,3-Epoxypropyl chloride; 3-Chloro-1,2-epoxypropane; 3-Chloro-1,2-propylene oxide; 3-Chloropropene-1,2-oxide; 3-Chloropropylene oxide; (DL)-α-Epichlorohydrin; Epichlorhydrin; Epichloorhydrine; Epichlorhydrine; Epichlorohydryna; Epicloridrina; Glycerol epichlorhydrin; Oxirane, 2-(chloromethyl); 1-Chloor-2,3-epoxy-propaan; 1-Chlor-2,3-epoxy-propan; 1-Cloro-2,3-epossipropano; Epichlorophydrin; Rcra waste number U041; UN 2023; NSC 6747

Phase change data

Data compiled by: Robert L. Brown and Stephen E. Stein
Quantity | Value | Units | Method | Reference | Comment |
---|---|---|---|---|---|
Tboil | 389.7 | K | N/A | Weast and Grasselli, 1989 |

References

Weast and Grasselli, 1989
CRC Handbook of Data on Organic Compounds, 2nd Editon, Weast,R.C and Grasselli, J.G., ed(s)., CRC Press, Inc., Boca Raton, FL, 1989, 1. [all data]