2-bromobutylbenzene

Phase change data

Data compiled by: Thermodynamics Research Center, NIST Boulder Laboratories, Chris Muzny director

Quantity Value Units Method Reference Comment
Tboil510.17KN/ALamneck, 1954Uncertainty assigned by TRC = 0.3 K
Quantity Value Units Method Reference Comment
Tfus228.26KN/ALamneck, 1954Uncertainty assigned by TRC = 0.02 K

In addition to the Thermodynamics Research Center (TRC) data available from this site, much more physical and chemical property data is available from the following TRC products:

References

Lamneck, 1954
Lamneck, J.H., Bromination of the two propylbenzenes and three butylbenzenes, J. Am. Chem. Soc., 1954, 76, 1106. [all data]