Benzoic acid, 3-amino-2,5-dichloro-
- Formula: C7H5Cl2NO2
- Molecular weight: 206.026
- IUPAC Standard InChIKey: HSSBORCLYSCBJR-UHFFFAOYSA-N
- CAS Registry Number: 133-90-4
- Chemical structure:
View 3d structure (requires JavaScript / HTML 5) - Other names: Ambiben; Amiben; Amibin; Amoben; Chlorambed; Chloramben; Chlorambene; Vegiben; 2,5-Dichloro-3-aminobenzoic acid; 3-Amino-2,5-dichlorobenzoic acid; Acpm-629; ACP-M-728; Amiben ds; Kyselina 3-amino-2,5-dichlorbenzoova; NCI-C00055; Ornamental weeder; Ornamental weeder 4G; Vegaben

Phase change data

Data compiled as indicated in comments:
TRC - Thermodynamics Research Center, NIST Boulder Laboratories, Chris Muzny director
AC - William E. Acree, Jr., James S. Chickos
Quantity | Value | Units | Method | Reference | Comment |
---|---|---|---|---|---|
Tfus | 475.75 | K | N/A | Donnelly, Drewes, et al., 1990 | Uncertainty assigned by TRC = 0.2 K; TRC |
Tfus | 474.5 | K | N/A | Plato, 1972 | Uncertainty assigned by TRC = 0.2 K; TRC |
Enthalpy of fusion
ΔfusH (kJ/mol) | Temperature (K) | Reference | Comment |
---|---|---|---|
37.42 | 475.6 | Acree, 1991 | AC |

References

Donnelly, Drewes, et al., 1990
Donnelly, J.R.; Drewes, L.A.; Johnson, R.L.; Munslow, W.D.; Knapp, K.K.; Sovocool, G.W.,
Purity and heat of fusion data for environmental standards as determined by differential scanning calorimetry,
Thermochim. Acta, 1990, 167, 2, 155, https://doi.org/10.1016/0040-6031(90)80476-F
. [all data]
Plato, 1972
Plato, C.,
DSC as a general method for determining purity and heat of fusion of high-purity organic chemicals,
Anal. Chem., 1972, 44, 1531. [all data]
Acree, 1991
Acree, William E.,
Thermodynamic properties of organic compounds: enthalpy of fusion and melting point temperature compilation,
Thermochimica Acta, 1991, 189, 1, 37-56, https://doi.org/10.1016/0040-6031(91)87098-H
. [all data]