N-(4-Bromophenyl)maleimide
- Formula: C10H6BrNO2
- Molecular weight: 252.064
- IUPAC Standard InChIKey: FECSFBYOMHWJQG-UHFFFAOYSA-N
- CAS Registry Number: 13380-67-1
- Chemical structure:
View 3d structure (requires JavaScript / HTML 5) - Permanent link for this species. Use this link for bookmarking this species for future reference.

Phase change data

Data compiled by: William E. Acree, Jr., James S. Chickos
Enthalpy of sublimation
ΔsubH (kJ/mol) | Temperature (K) | Method | Reference |
---|---|---|---|
105.9 ± 0.7 | 350. to 370. | C | Kiselev, Kashaeva, et al., 1998 |

Reaction thermochemistry data

Data compiled by: Hussein Y. Afeefy, Joel F. Liebman, and Stephen E. Stein
Individual Reactions
+
= C30H20BrNO3
By formula: C10H6BrNO2 + C20H14O = C30H20BrNO3
Quantity | Value | Units | Method | Reference | Comment |
---|---|---|---|---|---|
ΔrH° | -97.45 ± 0.63 | kJ/mol | Cm | Kiselev, Ustyugov, et al., 1977 | liquid phase; solvent: Dioxane |

References

Kiselev, Kashaeva, et al., 1998
Kiselev, V.D.; Kashaeva, E.A.; Konovalov, A.I.,
Enthalpies of sublimation, solution, and solvation of N-arylmaleimides,
Russ. J. Gen. Chem., 1998, 68, 8, 1246. [all data]
Kiselev, Ustyugov, et al., 1977
Kiselev, V.D.; Ustyugov, A.N.; Breus, I.P.; Konovalov, A.I.,
Kinetic and thermochemical study of the Diels-Alder reaction,
Dokl. Phys. Chem. (Engl. Transl.), 1977, 234, 320-322, In original 1089. [all data]