Cyclohexanone, 3-methyl-, (R)-
- Formula: C7H12O
- Molecular weight: 112.1696
- IUPAC Standard InChIKey: UJBOOUHRTQVGRU-ZCFIWIBFSA-N
- CAS Registry Number: 13368-65-5
- Chemical structure:
View 3d structure (requires JavaScript / HTML 5) - Stereoisomers:
- Other names: (+)-(3R)-3-Methylcyclohexanone; (+)-3-Methylcyclohexanone; (3R)-3-Methylcyclohexanone; (R)-(+)-3-Methylcyclohexanone; Cyclohexanone, 3-methyl-; 3-Methylcyclohexanone

Phase change data

Data compiled by: Robert L. Brown and Stephen E. Stein
Quantity | Value | Units | Method | Reference | Comment |
---|---|---|---|---|---|
Tboil | 442.2 | K | N/A | Weast and Grasselli, 1989 |

References

Weast and Grasselli, 1989
CRC Handbook of Data on Organic Compounds, 2nd Editon, Weast,R.C and Grasselli, J.G., ed(s)., CRC Press, Inc., Boca Raton, FL, 1989, 1. [all data]