Acetic acid, chloro-, isobutyl ester
- Formula: C6H11ClO2
- Molecular weight: 150.603
- IUPAC Standard InChIKey: QSGCJQBBHYWZHS-UHFFFAOYSA-N
- CAS Registry Number: 13361-35-8
- Chemical structure:
View 3d structure (requires JavaScript / HTML 5) - Other names: Acetic acid, chloro-, 2-methylpropyl ester; Isobutyl chloroacetate; Chloroacetic acid, 2-methylpropyl ester; 2-Methylpropyl chloroacetate

Condensed phase thermochemistry data

Data compiled by: Hussein Y. Afeefy, Joel F. Liebman, and Stephen E. Stein
Quantity | Value | Units | Method | Reference | Comment |
---|---|---|---|---|---|
ΔcH°liquid | -3399. | kJ/mol | Ccb | Schjanberg, 1935 |

Phase change data

Data compiled as indicated in comments:
ALS - Hussein Y. Afeefy, Joel F. Liebman, and Stephen E. Stein
AC - William E. Acree, Jr., James S. Chickos
Quantity | Value | Units | Method | Reference | Comment |
---|---|---|---|---|---|
ΔvapH° | 40. | kJ/mol | E | Schjanberg, 1935 | ALS |
Enthalpy of vaporization
ΔvapH (kJ/mol) | Temperature (K) | Method | Reference | Comment |
---|---|---|---|---|
43.9 | 308. | A | Stephenson and Malanowski, 1987 | Based on data from 293. to 323. K.; AC |

Kovats' RI, non-polar column, isothermal

Column type | Active phase | Temperature (C) | I | Reference | Comment |
---|---|---|---|---|---|
Capillary | OV-101 | 80. | 959.6 | Komárek, Hornová, et al., 1982 | N2; Column length: 15. m; Column diameter: 0.22 mm |

Van Den Dool and Kratz RI, non-polar column, temperature ramp

Column type | Active phase | I | Reference | Comment |
---|---|---|---|---|
Capillary | SE-30 | 956. | Korhonen, 1984 | 6. K/min; Column length: 25. m; Column diameter: 0.3 mm; Tstart: 50. C |
Capillary | SE-30 | 956. | Korhonen, 1984 | 6. K/min; Column length: 25. m; Column diameter: 0.3 mm; Tstart: 50. C |

Van Den Dool and Kratz RI, polar column, temperature ramp

Column type | Active phase | I | Reference | Comment |
---|---|---|---|---|
Capillary | OV-351 | 1392. | Korhonen, 1984 | 6. K/min; Column length: 25. m; Column diameter: 0.32 mm; Tstart: 50. C |
Capillary | OV-351 | 1392. | Korhonen, 1984 | 6. K/min; Column length: 25. m; Column diameter: 0.32 mm; Tstart: 50. C |

Normal alkane RI, non-polar column, temperature ramp

Column type | Active phase | I | Reference | Comment |
---|---|---|---|---|
Capillary | HP-5 MS | 964. | Kornilova, Ukolov, et al., 2012 | 25. m/0.20 mm/0.33 μm, Helium, 45. C @ 1. min, 5. K/min, 280. C @ 2. min |
Capillary | HP-5 MS | 988. | Kornilova, Ukolov, et al., 2012 | 25. m/0.20 mm/0.33 μm, Helium, 45. C @ 1. min, 5. K/min, 280. C @ 2. min |

Normal alkane RI, non-polar column, custom temperature program

Column type | Active phase | I | Reference | Comment |
---|---|---|---|---|
Capillary | OV-1, SE-30, Methyl silicone, SP-2100, OV-101, DB-1, etc. | 956. | Waggott and Davies, 1984 | Hydrogen; Column length: 50. m; Column diameter: 0.32 mm; Program: not specified |

References

Schjanberg, 1935
Schjanberg, E.,
Die Verbrennungswarmen und die Refraktionsdaten einiger chlorsubstituierter Fettsauren und Ester.,
Z. Phys. Chem. Abt. A, 1935, 172, 197-233. [all data]
Stephenson and Malanowski, 1987
Stephenson, Richard M.; Malanowski, Stanislaw,
Handbook of the Thermodynamics of Organic Compounds, 1987, https://doi.org/10.1007/978-94-009-3173-2
. [all data]
Komárek, Hornová, et al., 1982
Komárek, K.; Hornová, L.; Churácek, J.,
Glass capillary gas chromatography of homologous series of esters. Separation of homologous series of esters of halogenated carboxylic acids on a glass capillary column with the non-polar stationary silicone phase OV-101,
J. Chromatogr., 1982, 244, 1, 142-147, https://doi.org/10.1016/S0021-9673(00)80131-4
. [all data]
Korhonen, 1984
Korhonen, I.O.O.,
Gas-Liquid Chromatographic Analyses. XXV. Branched-Chain C3-C5 Alkyl Esters of Halogenated Acetic Acids,
J. Chromatogr., 1984, 288, 51-69, https://doi.org/10.1016/S0021-9673(01)93681-7
. [all data]
Kornilova, Ukolov, et al., 2012
Kornilova, T.A.; Ukolov, A.I.; Kostikov, R.R.; Zenkevich, I.G.,
Stability of diazocarbonyl compounds under the conditions of gas chromatography and chromatography-mass spectrometry analysis,
Rus. J. General Chem., 2012, 82, 10, 1675-1685, https://doi.org/10.1134/S1070363212100088
. [all data]
Waggott and Davies, 1984
Waggott, A.; Davies, I.W.,
Identification of organic pollutants using linear temperature programmed retention indices (LTPRIs) - Part II, 1984, retrieved from http://dwi.defra.gov.uk/research/completed-research/reports/dwi0383.pdf. [all data]