1-Pentadecene
- Formula: C15H30
- Molecular weight: 210.3987
- IUPAC Standard InChIKey: PJLHTVIBELQURV-UHFFFAOYSA-N
- CAS Registry Number: 13360-61-7
- Chemical structure:
View 3d structure (requires JavaScript / HTML 5) - Species with the same structure:
- Other names: Pentadecene,1-; Pentadec-1-ene

Phase change data

Data compiled as indicated in comments:
BS - Robert L. Brown and Stephen E. Stein
TRC - Thermodynamics Research Center, NIST Boulder Laboratories, Chris Muzny director
AC - William E. Acree, Jr., James S. Chickos
Quantity | Value | Units | Method | Reference | Comment |
---|---|---|---|---|---|
Tboil | 541.4 | K | N/A | Weast and Grasselli, 1989 | BS |
Quantity | Value | Units | Method | Reference | Comment |
Tfus | 269.3 ± 0.5 | K | AVG | N/A | Average of 6 values; Individual data points |
Quantity | Value | Units | Method | Reference | Comment |
ΔvapH° | 75.1 | kJ/mol | N/A | Reid, 1972 | AC |
Enthalpy of vaporization
ΔvapH (kJ/mol) | Temperature (K) | Method | Reference | Comment |
---|---|---|---|---|
65.2 | 390. | A | Stephenson and Malanowski, 1987 | Based on data from 375. to 407. K.; AC |
59.3 | 458. | A | Stephenson and Malanowski, 1987 | Based on data from 443. to 543. K. See also Camin and Rossini, 1955.; AC |
53.2 | 570. | N/A | Ambrose, Ellender, et al., 1975 | Based on data from 423. to 658. K.; AC |
Antoine Equation Parameters
log10(P) = A − (B / (T + C))
P = vapor pressure (bar)
T = temperature (K)
View plot Requires a JavaScript / HTML 5 canvas capable browser.
Temperature (K) | A | B | C | Reference |
---|---|---|---|---|
446.76 to 541.42 | 4.14045 | 1781.974 | -110.568 | Camin and Rossini, 1955 |

Kovats' RI, non-polar column, isothermal

View large format table.

Column type Active phase Temperature (C) I Reference Comment
CapillaryDB-1140.1488.Beens, Tijssen, et al., 199810. m/0.25 mm/0.25 μm, He
PackedSE-30150.1490.Tiess, 1984Ar, Gas Chrom Q (80-100 mesh); Column length: 3. m
CapillaryApolane130.1485.4Soják, Krupcík, et al., 1980N2; Column length: 200. m; Column diameter: 0.25 mm
CapillaryApolane160.1486.7Soják, Krupcík, et al., 1980, 2N2 or H2; Column length: 250. m; Column diameter: 0.25 mm
CapillaryApiezon L154.1488.Soják, Krupcík, et al., 1980, 2N2 or H2; Column length: 250. m; Column diameter: 0.25 mm
CapillaryApiezon L164.1488.0Soják, Krupcík, et al., 1980, 2N2 or H2; Column length: 250. m; Column diameter: 0.25 mm
CapillaryApiezon L164.1488.2Soják, Krupcík, et al., 1980, 2N2 or H2; Column length: 250. m; Column diameter: 0.25 mm
CapillaryApiezon L164.1488.8Soják, Krupcík, et al., 1980, 2N2 or H2; Column length: 250. m; Column diameter: 0.25 mm
CapillaryApiezon L164.1491.3Soják, Krupcík, et al., 1980, 2N2 or H2; Column length: 250. m; Column diameter: 0.25 mm
CapillarySqualane130.1484.Soják, Hrivnák, et al., 1974
CapillarySqualane130.1485.Soják, Hrivnák, et al., 1974

Kovats' RI, non-polar column, temperature ramp

View large format table.

Column type Active phase I Reference Comment
CapillaryOV-1011489.Ohnishi and Shibamoto, 19842. K/min; Column length: 50. m; Column diameter: 0.23 mm; Tstart: 80. C; Tend: 200. C
CapillaryOV-1011490.Ohnishi and Shibamoto, 19842. K/min; Column length: 50. m; Column diameter: 0.23 mm; Tstart: 80. C; Tend: 200. C

Kovats' RI, polar column, isothermal

View large format table.

Column type Active phase Temperature (C) I Reference Comment
CapillaryPEG-20M110.1527.Rang, Orav, et al., 1988
CapillaryCarbowax 20M110.1526.7Soják, Krupcík, et al., 1980, 2N2; Column length: 300. m; Column diameter: 0.25 mm

Van Den Dool and Kratz RI, non-polar column, temperature ramp

View large format table.

Column type Active phase I Reference Comment
CapillaryHP-5MS1492.8Zeng, Zhao, et al., 200730. m/0.25 mm/0.25 μm, He, 4. K/min; Tstart: 80. C; Tend: 300. C
CapillaryHP-51492.Flamini, Tebano, et al., 200630. m/0.25 mm/0.25 μm, N2, 60. C @ 10. min, 5. K/min; Tend: 220. C
CapillaryHP-51492.Flamini, Luigi Cioni, et al., 200530. m/0.25 mm/0.25 μm, N2, 60. C @ 10. min, 5. K/min; Tend: 220. C
CapillaryHP-51492.Dural, Bagci, et al., 200330. m/0.25 mm/0.25 μm, N2, 60. C @ 10. min, 5. K/min; Tend: 220. C
CapillaryHP-51492.Ertugrul, Dural, et al., 200330. m/0.25 mm/0.25 μm, N2, 60. C @ 10. min, 5. K/min; Tend: 220. C
CapillaryHP-11486.Senatore, Rigano, et al., 200330. m/0.25 mm/0.33 μm, He, 40. C @ 5. min, 2. K/min, 260. C @ 20. min
CapillaryHP-51489.Skaltsa, Demetzos, et al., 200330. m/0.25 mm/0.25 μm, He, 60. C @ 5. min, 4. K/min; Tend: 280. C
CapillaryDB-51492.4Song, Lai, et al., 200330. m/0.25 mm/0.25 μm, He, 2. K/min; Tstart: 40. C; Tend: 310. C
CapillaryDB-51492.5Song, Lai, et al., 200330. m/0.25 mm/0.25 μm, He, 4. K/min; Tstart: 40. C; Tend: 310. C
CapillaryDB-51492.3Song, Lai, et al., 200330. m/0.25 mm/0.25 μm, He, 6. K/min; Tstart: 40. C; Tend: 310. C
CapillaryHP-5MS1489.Skaltsa, Mavrommati, et al., 200130. m/0.25 mm/0.25 μm, He, 60. C @ 5. min, 4. K/min; Tend: 280. C
CapillaryHP-51494.Lazari, Skaltsa, et al., 200030. m/0.25 mm/0.25 μm, He, 50. C @ 5. min, 4. K/min; Tend: 280. C
CapillaryDB-11487.Beens, Tijssen, et al., 199810. m/0.25 mm/0.25 μm, He, 2. K/min; Tstart: 30. C; Tend: 225. C
CapillaryDB-51492.4Lai and Song, 199530. m/0.25 mm/0.25 μm, He, 2. K/min; Tstart: 40. C; Tend: 310. C
CapillaryDB-51492.5Lai and Song, 199530. m/0.25 mm/0.25 μm, He, 4. K/min; Tstart: 40. C; Tend: 310. C
CapillaryDB-51492.3Lai and Song, 199530. m/0.25 mm/0.25 μm, He, 6. K/min; Tstart: 40. C; Tend: 310. C

Van Den Dool and Kratz RI, non-polar column, custom temperature program

View large format table.

Column type Active phase I Reference Comment
CapillaryDB-5MS1488.Varlet V., Knockaert C., et al., 200630. m/0.32 mm/0.5 μm, He; Program: 70C(1min) => 3C/min => 80C(1min) => 5C/min => 150C => 10C/min => 280C (4min)
CapillaryDB-51493.Zaikin and Borisov, 2002He; Column length: 30. m; Column diameter: 0.25 mm; Program: 30C => 5K/min=120C => 10C/min => 270C

Van Den Dool and Kratz RI, polar column, temperature ramp

View large format table.

Column type Active phase I Reference Comment
CapillaryDB-Wax1515.Chung, Eiserich, et al., 1994He, 60. C @ 4. min, 3. K/min, 220. C @ 30. min; Column length: 60. m; Column diameter: 0.25 mm
CapillaryDB-Wax1550.Shiratsuchi, Shimoda, et al., 199460. m/0.25 mm/0.25 μm, He, 2. K/min, 230. C @ 60. min; Tstart: 50. C
CapillaryCP-WAX 57CB1552.Salter L.J., Mottram D.S., et al., 198860. C @ 5. min, 4. K/min; Column length: 50. m; Column diameter: 0.32 mm; Tend: 200. C

Normal alkane RI, non-polar column, temperature ramp

View large format table.

Column type Active phase I Reference Comment
CapillarySPB-51495.Sivadier, Ratel, et al., 200960. m/0.32 mm/1.00 μm, 40. C @ 5. min, 3. K/min, 230. C @ 10. min
CapillaryDB-51473.Havlik, Kokoska, et al., 200630. m/0.25 mm/0.25 μm, He, 3. K/min, 250. C @ 10. min; Tstart: 50. C
CapillaryDB-51492.Senatore, Landolfi, et al., 200630. m/0.25 mm/0.25 μm, He, 40. C @ 5. min, 2. K/min, 260. C @ 20. min
CapillaryPetrocol DH1490.Sojak, Kubinec, et al., 2006150. m/0.25 mm/1.0 μm, 1. K/min; Tstart: 40. C; Tend: 300. C
CapillaryDB-51491.Senatore, Apostolides Arnold, et al., 200530. m/0.25 mm/0.25 μm, He, 40. C @ 5. min, 2. K/min, 260. C @ 20. min
CapillaryHP-51492.Yayli, Yasar, et al., 200530. m/0.32 mm/0.25 μm, He, 60. C @ 2. min, 5. K/min, 260. C @ 13. min
CapillaryDB-51492.Woerdenbag, Windono, et al., 200430. m/0.249 mm/0.25 μm, He, 3. K/min; Tstart: 60. C; Tend: 300. C
CapillaryDB-51490.Flamini, Ertugrul, et al., 200230. m/0.25 mm/0.25 μm, He, 3. K/min; Tstart: 60. C; Tend: 240. C
CapillaryDB-11491.Stashenko, Puertas, et al., 199660. m/0.25 mm/0.25 μm, He, 50. C @ 5. min, 2.5 K/min; Tend: 250. C
CapillaryOV-1011488.Tamura, Nakamoto, et al., 1995N2, 2. K/min; Column length: 50. m; Column diameter: 0.25 mm; Tstart: 80. C; Tend: 200. C
CapillaryOV-1011490.Tamura, Nakamoto, et al., 1995N2, 2. K/min; Column length: 50. m; Column diameter: 0.25 mm; Tstart: 80. C; Tend: 200. C
CapillaryDB-11489.Binder and French, 19944. K/min, 230. C @ 10. min; Column length: 60. m; Column diameter: 0.32 mm; Tstart: 50. C
CapillaryCross-Linked Methylsilicone1490.Bravo and Hotchkiss, 1993He, 35. C @ 3. min, 4. K/min; Column length: 25. m; Column diameter: 0.32 mm; Tend: 225. C
CapillaryDB-11489.Binder, Benson, et al., 19904. K/min, 230. C @ 10. min; Column length: 60. m; Column diameter: 0.32 mm; Tstart: 50. C
CapillaryDB-11489.Binder, Turner, et al., 19904. K/min, 230. C @ 10. min; Tstart: 50. C
CapillaryDB-11489.Binder, Turner, et al., 1990, 24. K/min, 230. C @ 10. min; Column length: 60. m; Column diameter: 0.32 mm; Tstart: 50. C
CapillarySE-541492.Scribe, Ngoumbi-Nzouzi, et al., 19902. K/min; Column length: 25. m; Column diameter: 0.32 mm; Tstart: 100. C; Tend: 280. C
CapillaryOV-1011500.Sugisawa, Nakamura, et al., 1990Nitrogen, 2. K/min; Column length: 50. m; Column diameter: 0.25 mm; Tstart: 70. C; Tend: 200. C
CapillaryOV-1011491.Sugisawa, Nakamura, et al., 1990Nitrogen, 2. K/min; Column length: 50. m; Column diameter: 0.25 mm; Tstart: 80. C; Tend: 200. C
CapillaryOV-1011483.Stern, Flath, et al., 198550. C @ 0.1 min, 4. K/min, 225. C @ 30. min; Column length: 50. m; Column diameter: 0.32 mm
CapillarySP-21001488.Alencar, Alves, et al., 1983He, 4. K/min; Column length: 30. m; Column diameter: 0.25 mm; Tstart: 40. C; Tend: 250. C
CapillarySE-301488.Heydanek and McGorrin, 1981He, 40. C @ 3. min, 3. K/min; Column length: 50. m; Column diameter: 0.5 mm; Tend: 170. C
PackedApiezon L1488.Dahlmann, Köser, et al., 1979Chromosorb G-AW-DMCS, 10. K/min; Column length: 2. m; Tstart: 25. C

Normal alkane RI, non-polar column, custom temperature program

View large format table.

Column type Active phase I Reference Comment
CapillaryPolydimethyl siloxane with 5 % Ph groups1493.Robinson, Adams, et al., 2012Program: not specified
CapillaryPolydimethyl siloxane with 5 % Ph groups1493.Robinson, Adams, et al., 2012Program: not specified
CapillarySE-521502.Tognolini, Barocelli, et al., 200630. m/0.32 mm/0.15 μm, He; Program: 45C => 1C/min => 100C => 5C/min => 250C (10min)
CapillaryDexsil 3001478.Lockey, 1981Column length: 15. m; Program: 50 0C 5 0C/min -> 200 0C 2 0C/min -> 340 0C

Normal alkane RI, polar column, temperature ramp

View large format table.

Column type Active phase I Reference Comment
CapillaryDB-Wax1512.Havlik, Kokoska, et al., 200630. m/0.25 mm/0.25 μm, He, 3. K/min, 250. C @ 10. min; Tstart: 50. C
CapillaryDB-Wax1544.Binder and French, 19944. K/min, 230. C @ 10. min; Column length: 60. m; Column diameter: 0.32 mm; Tstart: 50. C
CapillaryDB-Wax1558.Chung, Eiserich, et al., 199360. C @ 4. min, 3. K/min; Column length: 60. m; Column diameter: 0.25 mm; Tend: 220. C
CapillaryDB-Wax1545.Binder, Benson, et al., 19904. K/min, 230. C @ 10. min; Column length: 60. m; Column diameter: 0.32 mm; Tstart: 50. C
CapillaryDB-Wax1545.Binder, Turner, et al., 19904. K/min, 230. C @ 10. min; Column length: 60. m; Column diameter: 0.32 mm; Tstart: 50. C
CapillaryDB-Wax1545.Binder, Turner, et al., 1990, 24. K/min, 230. C @ 10. min; Column length: 60. m; Column diameter: 0.32 mm; Tstart: 50. C
CapillaryCarbowax 20M1540.Buttery, Maddox, et al., 1986He, 60. C @ 40. min, 1. K/min; Column length: 150. m; Column diameter: 0.66 mm; Tend: 170. C
CapillaryCarbowax 20M1540.Buttery, Parker, et al., 198150. C @ 30. min, 1. K/min; Column length: 150. m; Column diameter: 0.64 mm; Tend: 170. C

References

Weast and Grasselli, 1989
CRC Handbook of Data on Organic Compounds, 2nd Editon, Weast,R.C and Grasselli, J.G., ed(s)., CRC Press, Inc., Boca Raton, FL, 1989, 1. [all data]
Reid, 1972
Reid, Robert C.,
Handbook on vapor pressure and heats of vaporization of hydrocarbons and related compounds, R. C. Wilhort and B. J. Zwolinski, Texas A Research Foundation. College Station, Texas(1971). 329 pages.$10.00,
AIChE J., 1972, 18, 6, 1278-1278, https://doi.org/10.1002/aic.690180637
. [all data]
Stephenson and Malanowski, 1987
Stephenson, Richard M.; Malanowski, Stanislaw,
Handbook of the Thermodynamics of Organic Compounds, 1987, https://doi.org/10.1007/978-94-009-3173-2
. [all data]
Camin and Rossini, 1955
Camin, David L.; Rossini, Frederick D.,
Physical Properties of Fourteen API Research Hydrocarbons, C 9 to C 15,
J. Phys. Chem., 1955, 59, 11, 1173-1179, https://doi.org/10.1021/j150533a014
. [all data]
Ambrose, Ellender, et al., 1975
Ambrose, D.; Ellender, J.H.; Lees, E.B.; Sprake, C.H.S.; Townsend, R.,
Thermodynamic properties of organic oxygen compounds XXXVIII. Vapour pressures of some aliphatic ketones,
The Journal of Chemical Thermodynamics, 1975, 7, 5, 453-472, https://doi.org/10.1016/0021-9614(75)90275-X
. [all data]