Benzenesulfonyl chloride, 2-methyl-
- Formula: C7H7ClO2S
- Molecular weight: 190.647
- IUPAC Standard InChIKey: HDECRAPHCDXMIJ-UHFFFAOYSA-N
- CAS Registry Number: 133-59-5
- Chemical structure:
View 3d structure (requires JavaScript / HTML 5) - Other names: o-Toluenesulfonyl chloride; o-Tosyl chloride; 2-Methylbenzenesulfonyl chloride; toluene-2-sulphonyl chloride

Phase change data

Data compiled by: Thermodynamics Research Center, NIST Boulder Laboratories, Chris Muzny director
Quantity | Value | Units | Method | Reference | Comment |
---|---|---|---|---|---|
Tfus | 283.59 | K | N/A | Witschonke, 1954 | Uncertainty assigned by TRC = 0.5 K |
Tfus | 284.65 | K | N/A | Witschonke, 1954 | Uncertainty assigned by TRC = 0.2 K |

References

Witschonke, 1954
Witschonke, C.R.,
Freezing point and purity data for some organic compounds,
Anal. Chem., 1954, 26, 562-4. [all data]