3-Methyl-4-cyclohexene-1,1,2,2-tetracarbonitrile
- Formula: C11H8N4
- Molecular weight: 196.2080
- IUPAC Standard InChIKey: VQCBYCIFFNDHIQ-UHFFFAOYSA-N
- CAS Registry Number: 13358-02-6
- Chemical structure:
View 3d structure (requires JavaScript / HTML 5) - Permanent link for this species. Use this link for bookmarking this species for future reference.

Gas phase thermochemistry data

Data compiled by: Hussein Y. Afeefy, Joel F. Liebman, and Stephen E. Stein
Quantity | Value | Units | Method | Reference | Comment |
---|---|---|---|---|---|
ΔfH°gas | 596.7 ± 4.5 | kJ/mol | Cm | Rogers, 1971 | Heat of formation derived by 77PED/RYL |

Condensed phase thermochemistry data

Data compiled by: Hussein Y. Afeefy, Joel F. Liebman, and Stephen E. Stein
Quantity | Value | Units | Method | Reference | Comment |
---|---|---|---|---|---|
ΔfH°solid | 514.7 ± 4.0 | kJ/mol | Cm | Rogers, 1971 | Heat of formation derived by 77PED/RYL |

Phase change data

Data compiled as indicated in comments:
DRB - Donald R. Burgess, Jr.
ALS - Hussein Y. Afeefy, Joel F. Liebman, and Stephen E. Stein
AC - William E. Acree, Jr., James S. Chickos
Quantity | Value | Units | Method | Reference | Comment |
---|---|---|---|---|---|
ΔsubH° | 82.0 | kJ/mol | N/A | Rogers, 1971 | DRB |
Enthalpy of sublimation
ΔsubH (kJ/mol) | Temperature (K) | Method | Reference | Comment |
---|---|---|---|---|
82.0 ± 2.1 | 350. | V | Rogers, 1971 | Heat of formation derived by 77PED/RYL; ALS |
82. ± 2.1 | 350. | MG | Rogers, 1971 | See also Pedley and Rylance, 1977.; AC |

Reaction thermochemistry data

Data compiled by: Hussein Y. Afeefy, Joel F. Liebman, and Stephen E. Stein
Individual Reactions
By formula: C11H8N4 = C6N4 + C5H8
Quantity | Value | Units | Method | Reference | Comment |
---|---|---|---|---|---|
ΔrH° | 157. ± 3. | kJ/mol | Cm | Rogers, 1971 | solid phase; Heat of formation derived by 77PED/RYL |
By formula: C6N4 + C5H8 = C11H8N4
Quantity | Value | Units | Method | Reference | Comment |
---|---|---|---|---|---|
ΔrH° | -157. ± 3. | kJ/mol | Cm | Rogers, 1971 | liquid phase; solvent: Dichloromethane |

References

Rogers, 1971
Rogers, F.E.,
Thermochemistry of the Diels-Alder reaction. I. Enthalpy of addition of isoprene to tetracyanoethylene,
J. Phys. Chem., 1971, 75, 1734-1737. [all data]
Pedley and Rylance, 1977
Pedley, J.B.; Rylance, J.,
, Computer Analysed Thermochemical Data: Organic and Organometallic Compounds, University of Sussex, Brighton, 1977. [all data]