Isocyclocitral
- Formula: C10H16O
- Molecular weight: 152.2334
- IUPAC Standard InChIKey: DEMWVPUIZCCHPT-UHFFFAOYSA-N
- CAS Registry Number: 1335-66-6
- Chemical structure:
View 3d structure (requires JavaScript / HTML 5) - Other names: 3-Cyclohexene-1-carboxaldehyde, 2,4,6-trimethyl-, and 3,5,6-trimethyl-3-cyclohexene-1-carboxaldehyde; 1-Formyl-3,5,6-trimethyl-3-cyclohexene and 1-formyl-2,4,6-trimethyl-3-cyclohexene; Isocyclocitral 1

Kovats' RI, non-polar column, isothermal

Column type | Active phase | Temperature (C) | I | Reference | Comment |
---|---|---|---|---|---|
Capillary | SE-30 | 100. | 1119.9 | Tudor, 1997 | 40. m/0.35 mm/0.35 μm |

Kovats' RI, polar column, isothermal

Column type | Active phase | Temperature (C) | I | Reference | Comment |
---|---|---|---|---|---|
Capillary | Carbowax 20M | 150. | 1515. | Tudor, Moldovan, et al., 1999 | Phase thickness: 0.08 μm |

Normal alkane RI, non-polar column, temperature ramp

Column type | Active phase | I | Reference | Comment |
---|---|---|---|---|
Capillary | Ultra 2 | 1117. | Byun and Shin, 2008 | 50. m/0.20 mm/0.11 μm, Helium, 60. C @ 5. min, 2. K/min, 230. C @ 30. min |

References

Tudor, 1997
Tudor, E.,
Temperature dependence of the retention index for perfumery compounds on a SE-30 glass capillary column. I. Linear equations,
J. Chromatogr. A, 1997, 779, 1-2, 287-297, https://doi.org/10.1016/S0021-9673(97)00453-6
. [all data]
Tudor, Moldovan, et al., 1999
Tudor, E.; Moldovan, D.; Zârna, N.,
Temperature dependence of the retention index for perfumery compounds on two carbowax-20M glass capillary columns with different film thickness. 2,
Rev. Roum. Chim., 1999, 44, 7, 665-675. [all data]
Byun and Shin, 2008
Byun, Y.; Shin, S.,
Analysis of compounds and activity of essential oil from Chrysanthemum zawadskii var. latilobum and C. indicum agaunst antibiotic-resistant pathogenic bacteria,
Nat. Prod. Sci., 2008, 14, 2, 138-142. [all data]