2,4(1H,3H)-Pyrimidinedione, 6-phenyl-
- Formula: C10H8N2O2
- Molecular weight: 188.1827
- IUPAC Standard InChIKey: NCSMAVULYUCSMB-UHFFFAOYSA-N
- CAS Registry Number: 13345-09-0
- Chemical structure:
View 3d structure (requires JavaScript / HTML 5) - Other names: 6-Phenyl-2,4(1H,3H)-pyrimidinedione; 6-Phenyluracil

Condensed phase thermochemistry data

Data compiled by: Hussein Y. Afeefy, Joel F. Liebman, and Stephen E. Stein
Quantity | Value | Units | Method | Reference | Comment |
---|---|---|---|---|---|
ΔcH°solid | -4748.4 | kJ/mol | Ccb | Fischer and Wrede, 1904 | Heat of combustion corrected for pressure |
ΔcH°solid | -4748.4 | kJ/mol | Ccb | Lemoult, 1904 |

References

Fischer and Wrede, 1904
Fischer, E.; Wrede, F.,
Uber die Verbrennungswarme einiger organischer Verbindungen,
Sitzungsber. Dtsch. Akad. Wiss. Berlin Kl. Math. Phys. Tech., 1904, 687-715. [all data]
Lemoult, 1904
Lemoult, M.P.,
Remarques sur une serie recenie de determinations calorimetriques,
Compt. Rend., 1904, 663-635. [all data]