4-Amino-1-butanol
- Formula: C4H11NO
- Molecular weight: 89.1362
- IUPAC Standard InChIKey: BLFRQYKZFKYQLO-UHFFFAOYSA-N
- CAS Registry Number: 13325-10-5
- Chemical structure:
View 3d structure (requires JavaScript / HTML 5) - Other names: 4-hdyroxybutylamine; H2NCH2(CH2)2CH2OH; 4-Aminobutanol-1; 1-Butanol, 4-amino-; 4-Aminobutanol; NH2(CH2)4OH

Phase change data

Data compiled as indicated in comments:
BS - Robert L. Brown and Stephen E. Stein
TRC - Thermodynamics Research Center, NIST Boulder Laboratories, Chris Muzny director
Quantity | Value | Units | Method | Reference | Comment |
---|---|---|---|---|---|
Tboil | 479.2 | K | N/A | Aldrich Chemical Company Inc., 1990 | BS |
Tboil | 479. | K | N/A | Buckingham and Donaghy, 1982 | BS |
Tboil | 476. | K | N/A | Brown and van Gulick, 1955 | Uncertainty assigned by TRC = 6. K; TRC |
Reduced pressure boiling point
Tboil (K) | Pressure (bar) | Reference | Comment |
---|---|---|---|
398.2 | 0.045 | Weast and Grasselli, 1989 | BS |
398. | 0.045 | Buckingham and Donaghy, 1982 | BS |

Gas phase ion energetics data

Data evaluated by: Edward P. Hunter and Sharon G. Lias
Quantity | Value | Units | Method | Reference | Comment |
---|---|---|---|---|---|
Proton affinity (review) | 984.5 | kJ/mol | N/A | Hunter and Lias, 1998 | |
Quantity | Value | Units | Method | Reference | Comment |
Gas basicity | 932.1 | kJ/mol | N/A | Hunter and Lias, 1998 |

References

Aldrich Chemical Company Inc., 1990
Aldrich Chemical Company Inc.,
Catalog Handbook of Fine Chemicals, Aldrich Chemical Company, Inc., Milwaukee WI, 1990, 1. [all data]
Buckingham and Donaghy, 1982
Buckingham, J.; Donaghy, S.M.,
Dictionary of Organic Compounds: Fifth Edition, Chapman and Hall, New York, 1982, 1. [all data]
Brown and van Gulick, 1955
Brown, R.F.; van Gulick, N.M.,
The Preparation of Geminally Substituted 4-Bromobutylamines I. 4-Bromobutylamine and 4-Bromo-1,1-dimethylbutylamine,
J. Am. Chem. Soc., 1955, 77, 1079. [all data]
Weast and Grasselli, 1989
CRC Handbook of Data on Organic Compounds, 2nd Editon, Weast,R.C and Grasselli, J.G., ed(s)., CRC Press, Inc., Boca Raton, FL, 1989, 1. [all data]
Hunter and Lias, 1998
Hunter, E.P.; Lias, S.G.,
Evaluated Gas Phase Basicities and Proton Affinities of Molecules: An Update,
J. Phys. Chem. Ref. Data, 1998, 27, 3, 413-656, https://doi.org/10.1063/1.556018
. [all data]