Propanedioic acid, ethyl-, diethyl ester
- Formula: C9H16O4
- Molecular weight: 188.2209
- IUPAC Standard InChIKey: VQAZCUCWHIIFGE-UHFFFAOYSA-N
- CAS Registry Number: 133-13-1
- Chemical structure:
View 3d structure (requires JavaScript / HTML 5) - Other names: Malonic acid, ethyl-, diethyl ester; Diethyl ethylmalonate; Diethyl 2-ethylmalonate; Ethyl diethylmalonate; Ethylmalonic acid diethyl ester

Phase change data

Data compiled as indicated in comments:
BS - Robert L. Brown and Stephen E. Stein
AC - William E. Acree, Jr., James S. Chickos
Reduced pressure boiling point
Tboil (K) | Pressure (bar) | Reference | Comment |
---|---|---|---|
349.2 | 0.007 | Aldrich Chemical Company Inc., 1990 | BS |
Enthalpy of vaporization
ΔvapH (kJ/mol) | Temperature (K) | Method | Reference | Comment |
---|---|---|---|---|
55.3 | 338. | A | Stephenson and Malanowski, 1987 | Based on data from 323. to 485. K. See also Stull, 1947.; AC |
Antoine Equation Parameters
log10(P) = A − (B / (T + C))
P = vapor pressure (bar)
T = temperature (K)
View plot Requires a JavaScript / HTML 5 canvas capable browser.
Temperature (K) | A | B | C | Reference | Comment |
---|---|---|---|---|---|
323.9 to 484.7 | 5.09388 | 2265.223 | -39.60 | Stull, 1947 | Coefficents calculated by NIST from author's data. |

Normal alkane RI, non-polar column, custom temperature program

Column type | Active phase | I | Reference | Comment |
---|---|---|---|---|
Capillary | Methyl Silicone | 1148. | Zenkevich, 1999 | Program: not specified |

References

Aldrich Chemical Company Inc., 1990
Aldrich Chemical Company Inc.,
Catalog Handbook of Fine Chemicals, Aldrich Chemical Company, Inc., Milwaukee WI, 1990, 1. [all data]
Stephenson and Malanowski, 1987
Stephenson, Richard M.; Malanowski, Stanislaw,
Handbook of the Thermodynamics of Organic Compounds, 1987, https://doi.org/10.1007/978-94-009-3173-2
. [all data]
Stull, 1947
Stull, Daniel R.,
Vapor Pressure of Pure Substances. Organic and Inorganic Compounds,
Ind. Eng. Chem., 1947, 39, 4, 517-540, https://doi.org/10.1021/ie50448a022
. [all data]
Zenkevich, 1999
Zenkevich, I.G.,
Mutual Correlation between Gas-Chromatographic Retention Indices of Organic Compounds from Different Series,
Zh. Anal. Khim., 1999, 54, 12, 1272-1279. [all data]