Cyclohexanone, 4-methyl-
- Formula: C7H12O
- Molecular weight: 112.1696
- IUPAC Standard InChIKey: VGVHNLRUAMRIEW-UHFFFAOYSA-N
- CAS Registry Number: 1331-22-2
- Chemical structure:
View 3d structure (requires JavaScript / HTML 5) - Species with the same structure:
- Other names: methylcyclohexanone; methycyclohexanone

Phase change data

Data compiled by: Thermodynamics Research Center, NIST Boulder Laboratories, Chris Muzny director
Quantity | Value | Units | Method | Reference | Comment |
---|---|---|---|---|---|
Tboil | 438.2 | K | N/A | Othmer, 1943 | Uncertainty assigned by TRC = 2. K |

References

Othmer, 1943
Othmer, D.F.,
Composition of vapors from boiling binary solutions,
Ind. Eng. Chem., 1943, 35, 614-20. [all data]