Diethyl butylmalonate
- Formula: C11H20O4
- Molecular weight: 216.2741
- IUPAC Standard InChIKey: RPNFNBGRHCUORR-UHFFFAOYSA-N
- CAS Registry Number: 133-08-4
- Chemical structure:
View 3d structure (requires JavaScript / HTML 5) - Other names: Malonic acid, butyl-, diethyl ester; Butylmalonic acid diethyl ester; Diethyl n-butylmalonate; Ethyl butylmalonate; Diethyl normal-butylmalonate; n-Butylmalonic acid diethyl ester; Propanedioic acid, butyl-, diethyl ester; Diethyl 2-butylmalonate; Butylpropanedioic acid diethyl ester

Phase change data

Data compiled as indicated in comments:
BS - Robert L. Brown and Stephen E. Stein
TRC - Thermodynamics Research Center, NIST Boulder Laboratories, Chris Muzny director
Quantity | Value | Units | Method | Reference | Comment |
---|---|---|---|---|---|
Tboil | 510.7 | K | N/A | Weast and Grasselli, 1989 | BS |
Tboil | 511. | K | N/A | Adams and Marvel, 1919 | Uncertainty assigned by TRC = 6. K; TRC |

Normal alkane RI, non-polar column, custom temperature program

Column type | Active phase | I | Reference | Comment |
---|---|---|---|---|
Capillary | Methyl Silicone | 1323. | Zenkevich, 1999 | Program: not specified |

References

Weast and Grasselli, 1989
CRC Handbook of Data on Organic Compounds, 2nd Editon, Weast,R.C and Grasselli, J.G., ed(s)., CRC Press, Inc., Boca Raton, FL, 1989, 1. [all data]
Adams and Marvel, 1919
Adams, R.; Marvel, C.S.,
Organic Chemical Reagents VI. Reagents from n-Butyl Alcohol,
J. Am. Chem. Soc., 1919, 42, 311. [all data]
Zenkevich, 1999
Zenkevich, I.G.,
Mutual Correlation between Gas-Chromatographic Retention Indices of Organic Compounds from Different Series,
Zh. Anal. Khim., 1999, 54, 12, 1272-1279. [all data]