(Z) 3,3'-Bis-(1-cyclohexenylidene)
- Formula: C12H16
- Molecular weight: 160.2554
- IUPAC Standard InChIKey: IMTIYIKRBGNQTQ-QXMHVHEDSA-N
- CAS Registry Number: 132911-35-4
- Chemical structure:
View 3d structure (requires JavaScript / HTML 5) - Stereoisomers:

Gas phase thermochemistry data

Data compiled by: Hussein Y. Afeefy, Joel F. Liebman, and Stephen E. Stein
Quantity | Value | Units | Method | Reference | Comment |
---|---|---|---|---|---|
ΔfH°gas | 92.5 | kJ/mol | Chyd | Roth, Adamczak, et al., 1991 |

Reaction thermochemistry data

Data compiled by: Hussein Y. Afeefy, Joel F. Liebman, and Stephen E. Stein
Individual Reactions
By formula: C12H16 + 3H2 = C12H22
Quantity | Value | Units | Method | Reference | Comment |
---|---|---|---|---|---|
ΔrH° | -308. ± 0.8 | kJ/mol | Chyd | Roth, Adamczak, et al., 1991 | liquid phase |
By formula: C12H16 = C12H16
Quantity | Value | Units | Method | Reference | Comment |
---|---|---|---|---|---|
ΔrH° | -1. ± 1. | kJ/mol | Kin | Doering, Roth, et al., 1991 | gas phase; At 568 K |

References

Roth, Adamczak, et al., 1991
Roth, W.R.; Adamczak, O.; Breuckmann, R.; Lennartz, H.-W.; Boese, R.,
Die Berechnung von Resonanzenergien; das MM2ERW-Kraftfeld,
Chem. Ber., 1991, 124, 2499-2521. [all data]
Doering, Roth, et al., 1991
Doering, W.E.; Roth, W.R.; Bauer, F.; Boenke, M.; Breuckmann, R.; Ruhkamp, J.; Wortmann, O.,
Rotationsbarrieren Vinyl-substituierter Olefine,
Chem. Ber., 1991, 124, 1461-1470. [all data]