Butane, 3-methyl-1-(methylthio)-
- Formula: C6H14S
- Molecular weight: 118.240
- IUPAC Standard InChIKey: ABIKQXWLJOURPN-UHFFFAOYSA-N
- CAS Registry Number: 13286-90-3
- Chemical structure:
View 3d structure (requires JavaScript / HTML 5) - Other names: Sulfide, isopentyl methyl; 5-Methyl-2-thiahexane; 3-Methyl-1-(methylsulfanyl)butane; (3-Methylbutyl) methyl sulfide; Methyl isopentyl sulfide; methyl 3-methylbutyl sulfide

Kovats' RI, non-polar column, isothermal

Column type | Active phase | Temperature (C) | I | Reference | Comment |
---|---|---|---|---|---|
Packed | Apiezon M | 130. | 880. | Garbuzov, Misharina, et al., 1985 | He or N2, Chromosorb W, AW-DMCS; Column length: 2.1 m |

Van Den Dool and Kratz RI, non-polar column, temperature ramp

Column type | Active phase | I | Reference | Comment |
---|---|---|---|---|
Capillary | HP-5 | 869. | Solina, Baumgartner, et al., 2005 | 25. m/0.2 mm/1. μm, He, 5. K/min, 280. C @ 5. min; Tstart: 40. C |

Normal alkane RI, non-polar column, custom temperature program

Column type | Active phase | I | Reference | Comment |
---|---|---|---|---|
Capillary | Apiezon M | 880. | N/A | Program: not specified |
Capillary | Apiezon M | 880. | Liu, Cao, et al., 2005 | Program: not specified |
Capillary | Methyl Silicone | 870. | Zenkevich, 1999 | Program: not specified |
Capillary | methyl silicone oil with 5% Igepal | 862. | Schultz, Flath, et al., 1988 | Column length: 150. m; Column diameter: 0.75 mm; Program: not specified |
Capillary | methyl silicone oil with 5% Igepal | 864. | Schultz, Flath, et al., 1988 | Column length: 150. m; Column diameter: 0.75 mm; Program: not specified |

References

Garbuzov, Misharina, et al., 1985
Garbuzov, V.G.; Misharina, T.A.; Aerov, A.F.; Golovnya, R.V.,
Gas chromatographic retention indices for sulphur(II)-containing organic substances,
J. Anal. Chem. USSR (Engl. Transl.), 1985, 40, 4, 576-586. [all data]
Solina, Baumgartner, et al., 2005
Solina, M.; Baumgartner, P.; Johnson, R.L.; Whitfield, F.B.,
Volatile aroma components of soy protein isolate and acid-hydrolysed vegetable protein,
Food Chem., 2005, 90, 4, 861-873, https://doi.org/10.1016/j.foodchem.2004.06.005
. [all data]
Liu, Cao, et al., 2005
Liu, L.; Cao, C.-Z.; Xie, B.; Zou, L.-K.,
Research of QSSR on chromatography retention index of sulfides and mercaptans,
Journal of Hunan University of Science and Technology, 2005, 20, 4, 74-80. [all data]
Zenkevich, 1999
Zenkevich, I.G.,
Dependence of Gas Chromatographic Retention Indices on Dynamics Molecular Characteristics,
Zh. Fiz. Khim., 1999, 73, 5, 905-910. [all data]
Schultz, Flath, et al., 1988
Schultz, T.H.; Flath, R.A.; Stern, D.J.; Mon, T.R.; Teranishi, R.; McKenna Kruse, S.; Butlder, B.; Howard, W.E.,
Coyote estrous urine volatiles,
J. Chem. Ecol., 1988, 14, 2, 701-712, https://doi.org/10.1007/BF01013917
. [all data]