Borane
- Formula: BH3
- Molecular weight: 13.835
- IUPAC Standard InChIKey: UORVGPXVDQYIDP-UHFFFAOYSA-N
- CAS Registry Number: 13283-31-3
- Chemical structure:
View 3d structure (requires JavaScript / HTML 5) - Permanent link for this species. Use this link for bookmarking this species for future reference.

Gas phase thermochemistry data

Quantity | Value | Units | Method | Reference | Comment |
---|---|---|---|---|---|
ΔfH°gas | 106.69 | kJ/mol | Review | Chase, 1998 | Data last reviewed in December, 1964 |
Quantity | Value | Units | Method | Reference | Comment |
S°gas,1 bar | 187.88 | J/mol*K | Review | Chase, 1998 | Data last reviewed in December, 1964 |
Gas Phase Heat Capacity (Shomate Equation)
Cp° = A + B*t + C*t2 + D*t3 +
E/t2
H° − H°298.15= A*t + B*t2/2 +
C*t3/3 + D*t4/4 − E/t + F − H
S° = A*ln(t) + B*t + C*t2/2 + D*t3/3 −
E/(2*t2) + G
Cp = heat capacity (J/mol*K)
H° = standard enthalpy (kJ/mol)
S° = standard entropy (J/mol*K)
t = temperature (K) / 1000.
View plot Requires a JavaScript / HTML 5 canvas capable browser.
Temperature (K) | 298. to 1300. | 1300. to 6000. |
---|---|---|
A | 22.88661 | 68.71969 |
B | 33.51995 | 7.326644 |
C | 10.25691 | -1.379298 |
D | -8.515151 | 0.090359 |
E | 0.238611 | -18.52081 |
F | 99.10683 | 49.59044 |
G | 206.5461 | 226.5423 |
H | 106.6920 | 106.6920 |
Reference | Chase, 1998 | Chase, 1998 |
Comment | Data last reviewed in December, 1964 | Data last reviewed in December, 1964 |

Reaction thermochemistry data

Data compiled by: John E. Bartmess
Individual Reactions
By formula: H- + H3B = (H- • H3B)
Quantity | Value | Units | Method | Reference | Comment |
---|---|---|---|---|---|
ΔrH° | 310. ± 12. | kJ/mol | Endo | Workman and Squires, 1988 | gas phase; From Endo threshold for hydride transfer to CO2 |
ΔrH° | 322. ± 8.4 | kJ/mol | Ther | Krivtsov, Titova, et al., 1977 | gas phase; value altered from reference due to conversion from electron convention to ion convention |
ΔrH° | 341.4 | kJ/mol | Ther | Altschuller, 1955 | gas phase |
By formula: H4B- + H3B = (H4B- • H3B)
Quantity | Value | Units | Method | Reference | Comment |
---|---|---|---|---|---|
ΔrH° | 165. ± 5.0 | kJ/mol | CIDT | Workman and Squires, 1988 | gas phase; CID threshold in Ar target |
By formula: CN- + H3B = (CN- • H3B)
Quantity | Value | Units | Method | Reference | Comment |
---|---|---|---|---|---|
ΔrH° | 256. ± 8.8 | kJ/mol | Endo | Workman and Squires, 1988 | gas phase |
H2B- + =
Quantity | Value | Units | Method | Reference | Comment |
---|---|---|---|---|---|
ΔrH° | 1723.0 | kJ/mol | N/A | Bartmess and Hinde, 2005 | gas phase |

Ion clustering data

Data compiled by: John E. Bartmess
Clustering reactions
By formula: CN- + H3B = (CN- • H3B)
Quantity | Value | Units | Method | Reference | Comment |
---|---|---|---|---|---|
ΔrH° | 256. ± 8.8 | kJ/mol | Endo | Workman and Squires, 1988 | gas phase |
By formula: H- + H3B = (H- • H3B)
Quantity | Value | Units | Method | Reference | Comment |
---|---|---|---|---|---|
ΔrH° | 310. ± 12. | kJ/mol | Endo | Workman and Squires, 1988 | gas phase; From Endo threshold for hydride transfer to CO2 |
ΔrH° | 322. ± 8.4 | kJ/mol | Ther | Krivtsov, Titova, et al., 1977 | gas phase; value altered from reference due to conversion from electron convention to ion convention |
ΔrH° | 341.4 | kJ/mol | Ther | Altschuller, 1955 | gas phase |
By formula: H4B- + H3B = (H4B- • H3B)
Quantity | Value | Units | Method | Reference | Comment |
---|---|---|---|---|---|
ΔrH° | 165. ± 5.0 | kJ/mol | CIDT | Workman and Squires, 1988 | gas phase; CID threshold in Ar target |

Gas phase ion energetics data

Data compiled as indicated in comments:
B - John E. Bartmess
LL - Sharon G. Lias and Joel F. Liebman
RDSH - Henry M. Rosenstock, Keith Draxl, Bruce W. Steiner, and John T. Herron
Electron affinity determinations
EA (eV) | Method | Reference | Comment |
---|---|---|---|
0.038 ± 0.015 | LPES | Wickham-Jones, Moran, et al., 1989 | B |
Ionization energy determinations
IE (eV) | Method | Reference | Comment |
---|---|---|---|
12.026 ± 0.024 | PI | Ruscic, Mayhew, et al., 1988 | LL |
14. ± 2. | EI | Herstad, Pressley, et al., 1970 | RDSH |
11.5 ± 0.5 | EI | Steck, Pressley, et al., 1969 | RDSH |
12.2 ± 0.1 | EI | Ganguli and McGee, 1969 | RDSH |
12.3 ± 0.1 | EI | Wilson and McGee, 1967 | RDSH |
11. | EI | Baylis, Pressley, et al., 1966 | RDSH |
11.4 ± 0.2 | EI | Fehlner and Koski, 1964 | RDSH |
Appearance energy determinations
Ion | AE (eV) | Other Products | Method | Reference | Comment |
---|---|---|---|---|---|
BH+ | ≤13.372 ± 0.015 | H2 | PI | Ruscic, Mayhew, et al., 1988 | LL |
BH+ | 13.7 ± 1.0 | H2? | EI | Steck, Pressley, et al., 1969 | RDSH |
BH+ | 13.66 ± 0.02 | H2? | EI | Wilson and McGee, 1967 | RDSH |
BH2+ | ≤12.819 ± 0.020 | H | PI | Ruscic, Mayhew, et al., 1988 | LL |
BH2+ | 12.3 ± 0.5 | H | EI | Steck, Pressley, et al., 1969 | RDSH |
BH2+ | 12.95 | H | EI | Wilson and McGee, 1967 | RDSH |
De-protonation reactions
H2B- + =
Quantity | Value | Units | Method | Reference | Comment |
---|---|---|---|---|---|
ΔrH° | 411.80 | kcal/mol | N/A | Bartmess and Hinde, 2005 | gas phase; B |

References

Chase, 1998
Chase, M.W., Jr.,
NIST-JANAF Themochemical Tables, Fourth Edition,
J. Phys. Chem. Ref. Data, Monograph 9, 1998, 1-1951. [all data]
Workman and Squires, 1988
Workman, D.B.; Squires, R.R.,
Hydride Binding Energies of Boranes,
Inorg. Chem., 1988, 27, 11, 1846, https://doi.org/10.1021/ic00284a003
. [all data]
Krivtsov, Titova, et al., 1977
Krivtsov, N.V.; Titova, K.V.; Rosolovskii, V.Ya.,
Thermochemical study of complex borates,
Russ. J. Inorg. Chem., 1977, 22, 374. [all data]
Altschuller, 1955
Altschuller, A.P.,
Lattice Energies and Related Thermodynamic Properties of the Alkali Metal Borohydrides and of the Borohydride Ion,
J. Am. Chem. Soc., 1955, 77, 21, 5455, https://doi.org/10.1021/ja01626a001
. [all data]
Bartmess and Hinde, 2005
Bartmess, J.E.; Hinde, R.J.,
The Gas Phase Acidities of the Elemental Hydrides are Functions of Bond Lengths and Electronegativity,
Can. J. Chem., 2005, 83, 11, 2005-2012, https://doi.org/10.1139/v05-218
. [all data]