1,1,3-trichlorobutane
- Formula: C4H7Cl3
- Molecular weight: 161.457
- IUPAC Standard InChIKey: GSBUVYHAANRCNO-UHFFFAOYSA-N
- CAS Registry Number: 13279-87-3
- Chemical structure:
View 3d structure (requires JavaScript / HTML 5) - Permanent link for this species. Use this link for bookmarking this species for future reference.

Phase change data

Data compiled by: Thermodynamics Research Center, NIST Boulder Laboratories, Chris Muzny director
Quantity | Value | Units | Method | Reference | Comment |
---|---|---|---|---|---|
Tboil | 423. | K | N/A | Schmerling, 1946 | Uncertainty assigned by TRC = 4. K |
Tboil | 423. | K | N/A | Schmerling, 1946 | Uncertainty assigned by TRC = 3. K |

References

Schmerling, 1946
Schmerling, L.,
Condensation of Saturated Halides with Unsaturated Compounds II. The Condensation of ALkyl Halides with Monohaloolefins,
J. Am. Chem. Soc., 1946, 68, 1650-4. [all data]