1-Hexanol, 3-methyl-
- Formula: C7H16O
- Molecular weight: 116.2013
- IUPAC Standard InChIKey: YGZVAQICDGBHMD-UHFFFAOYSA-N
- CAS Registry Number: 13231-81-7
- Chemical structure:
View 3d structure (requires JavaScript / HTML 5) - Other names: 3-Methyl-1-hexanol; 3-Methylhexan-1-ol; 3-Methylhexanol

Phase change data

Data compiled as indicated in comments:
TRC - Thermodynamics Research Center, NIST Boulder Laboratories, Chris Muzny director
AC - William E. Acree, Jr., James S. Chickos
Quantity | Value | Units | Method | Reference | Comment |
---|---|---|---|---|---|
Tboil | 445.35 | K | N/A | Pichler, Ziesecke, et al., 1950 | Uncertainty assigned by TRC = 0.5 K; TRC |
Tboil | 445.35 | K | N/A | Norris and Cortese, 1927 | Uncertainty assigned by TRC = 0.3 K; TRC |
Enthalpy of vaporization
ΔvapH (kJ/mol) | Temperature (K) | Reference | Comment |
---|---|---|---|
57.4 | 399. | Wilhoit and Zwolinski, 1973 | Based on data from 353. to 445. K.; AC |

Van Den Dool and Kratz RI, polar column, temperature ramp

Data compiled by: NIST Mass Spectrometry Data Center, William E. Wallace, director

Column type CapillaryCapillary
Active phase Carbowax 20MCP-Wax 52CB
Column length (m) 60.60.
Carrier gas HeHe
Substrate
Column diameter (mm) 0.250.25
Phase thickness (μm) 0.250.25
Tstart (C) 45.45.
Tend (C) 250.250.
Heat rate (K/min) 2.2.
Initial hold (min) 0.170.17
Final hold (min)
I 1413.1413.
ReferenceVerzera, Campisi, et al., 2005Verzera, Campisi, et al., 2001
Comment MSDC-RI MSDC-RI

Van Den Dool and Kratz RI, non-polar column, temperature ramp

View large format table.

Column type Active phase I Reference Comment
CapillaryDB-1895.Bartley and Foley, 199460. m/0.32 mm/0.5 μm, 40. C @ 2. min, 4. K/min, 290. C @ 5. min

Normal alkane RI, polar column, custom temperature program

View large format table.

Column type Active phase I Reference Comment
CapillaryCarbowax 20M1413.Editorial paper, 2005Program: not specified

References

Pichler, Ziesecke, et al., 1950
Pichler, H.; Ziesecke, K.H.; Traeger, B.,
The Oxygen-containing Compounds, Especially Alcohols, Formed in Isosynthesis,
Brennst.-Chem., 1950, 31, 361. [all data]
Norris and Cortese, 1927
Norris, J.F.; Cortese, F.,
The reactivity of atoms and groups in organic compounds: II. second contribution on the relative reactivities of the hydroxyl-hydrogen atoms in certain alcohols,
J. Am. Chem. Soc., 1927, 49, 2640-50. [all data]
Wilhoit and Zwolinski, 1973
Wilhoit, R.C.; Zwolinski, B.J.,
Physical and thermodynamic properties of aliphatic alcohols,
J. Phys. Chem. Ref. Data Suppl., 1973, 1, 2, 1. [all data]