isobutylethyl-amine
- Formula: C6H15N
- Molecular weight: 101.1900
- IUPAC Standard InChIKey: FNLUJDLKYOWMMF-UHFFFAOYSA-N
- CAS Registry Number: 13205-60-2
- Chemical structure:
View 3d structure (requires JavaScript / HTML 5) - Other names: Ethyl isobutylamine; 1-Propanamine, N-ethyl-2-methyl

Phase change data

Data compiled by: Thermodynamics Research Center, NIST Boulder Laboratories, Chris Muzny director
Quantity | Value | Units | Method | Reference | Comment |
---|---|---|---|---|---|
Tboil | 370.65 | K | N/A | Cope, Lebel, et al., 1957 | Uncertainty assigned by TRC = 1.5 K |
Tboil | 350.65 | K | N/A | Bortnick, Luskin, et al., 1956 | Uncertainty assigned by TRC = 3. K |
Tboil | 371.15 | K | N/A | Marckwald and Droste-Huelshoff, 1899 | Uncertainty assigned by TRC = 4. K |

Reaction thermochemistry data

Data compiled by: Hussein Y. Afeefy, Joel F. Liebman, and Stephen E. Stein
Individual Reactions
+ C6H13N =
By formula: H2 + C6H13N = C6H15N
Quantity | Value | Units | Method | Reference | Comment |
---|---|---|---|---|---|
ΔrH° | 88. ± 2. | kJ/mol | Cm | Jackman and Packham, 1957 | liquid phase; solvent: bis-2-Ethoxyethyl ether |

Kovats' RI, non-polar column, isothermal

Column type | Active phase | Temperature (C) | I | Reference | Comment |
---|---|---|---|---|---|
Packed | Apiezon L | 100. | 705. | Golovnya, Zhuravleva, et al., 1981 | N2, Chromosorb GAW; Column length: 2.7 m |

Kovats' RI, polar column, isothermal

Column type | Active phase | Temperature (C) | I | Reference | Comment |
---|---|---|---|---|---|
Capillary | PEG-40M+KF | 110. | 841. | Svetlova, Samusenko, et al., 1986 |

References

Cope, Lebel, et al., 1957
Cope, A.C.; Lebel, N.A.; Lee, H.-H.; Moore, W.R.,
Amine oxides: III selective formation of olefins from unsymmetrical amine oxides and quaternary ammonium hydroxides,
J. Am. Chem. Soc., 1957, 79, 4720. [all data]
Bortnick, Luskin, et al., 1956
Bortnick, N.; Luskin, L.S.; Hurwitz, M.D.; Craig, W.E.; Exner, L.J.; Mirza, J.,
T-carbinamines, rr'r''cnh(2): I reaction with alkyl halides and alkylene oxides,
J. Am. Chem. Soc., 1956, 78, 4039. [all data]
Marckwald and Droste-Huelshoff, 1899
Marckwald, W.; Droste-Huelshoff,
Chem. Ber., 1899, 32, 560. [all data]
Jackman and Packham, 1957
Jackman, L.M.; Packham, D.I.,
The experimental resonance energy of acridine,
Proc. Chem. Soc., London, 1957, 349-350. [all data]
Golovnya, Zhuravleva, et al., 1981
Golovnya, R.V.; Zhuravleva, I.L.; Svetlova, N.I.; Grigor'eva, D.N.; Terenina, M.B.; Gutnik, S.B.,
Gas-chromatographic behavior of secondary isoaliphatic and alicyclic amines,
J. Anal. Chem. USSR (Engl. Transl.), 1981, 36, 4, 501-505. [all data]
Svetlova, Samusenko, et al., 1986
Svetlova, N.I.; Samusenko, A.L.; Golovnya, R.V.,
Advantage of the universal equation over the linear equation for the calculation of retention parameters of homologous series in capillary chromatography,
J. Hi. Res. Chromatogr. Chromatogr. Comm., 1986, 9, 12, 737-740, https://doi.org/10.1002/jhrc.1240091205
. [all data]