Naphthoic acid
- Formula: C11H8O2
- Molecular weight: 172.1800
- IUPAC Standard InChIKey: LNETULKMXZVUST-UHFFFAOYSA-N
- CAS Registry Number: 1320-04-3
- Chemical structure:
View 3d structure (requires JavaScript / HTML 5) - Species with the same structure:

Condensed phase thermochemistry data

Data compiled by: Hussein Y. Afeefy, Joel F. Liebman, and Stephen E. Stein
Quantity | Value | Units | Method | Reference | Comment |
---|---|---|---|---|---|
ΔcH°solid | -5110.7 ± 5.1 | kJ/mol | Ccb | Balcan, Arzik, et al., 1996 | Corresponding ΔfHºsolid = -361.2 kJ/mol (simple calculation by NIST; no Washburn corrections) |

References

Balcan, Arzik, et al., 1996
Balcan, M.; Arzik, S.; Altunata, T.,
The determination of the heats of combustion and the resonance energies of some substituted naphthalenes,
Thermochim. Acta, 1996, 278, 49-56. [all data]