2-Naphthalenol, 1-nitroso-
- Formula: C10H7NO2
- Molecular weight: 173.1681
- IUPAC Standard InChIKey: YXAOOTNFFAQIPZ-UHFFFAOYSA-N
- CAS Registry Number: 131-91-9
- Chemical structure:
View 3d structure (requires JavaScript / HTML 5) - Other names: 2-Naphthol, 1-nitroso-; α-Nitroso-β-naphthol; 1-Nitroso-2-naphthol; Nitroso-β-naphthol; C.I. 10000; α-Nitroso-β-naftol; 1-Nitroso-2-naftol; Zelen moridlova 4; 1-Nitroso-2-naphthalenol; NSC 4151

Phase change data

Data compiled by: Hussein Y. Afeefy, Joel F. Liebman, and Stephen E. Stein
Quantity | Value | Units | Method | Reference | Comment |
---|---|---|---|---|---|
ΔsubH° | 86.6 ± 4.2 | kJ/mol | V | Hamilton and Fagley, 1968 | see Hamilton, 1964 |

References

Hamilton and Fagley, 1968
Hamilton, J.V.; Fagley, T.F.,
Thermochemical study of the structures of 1,2-, 2,1-, and 4,1-nitrosonaphthols,
J. Chem. Eng. Data, 1968, 13, 523-527. [all data]
Hamilton, 1964
Hamilton, J.V.,
A thermochemical study of the structures of 1,2-, 2,1- and 4,1-nitrosonaphthols, Dissertation Abstract, 1964, 3113. [all data]