Phenol, 2-cyclohexyl-4,6-dinitro-
- Formula: C12H14N2O5
- Molecular weight: 266.2500
- IUPAC Standard InChIKey: QJYHUJAGJUHXJN-UHFFFAOYSA-N
- CAS Registry Number: 131-89-5
- Chemical structure:
View 3d structure (requires JavaScript / HTML 5) - Other names: Dinex; Dry Mix No. 1; DN Dry Mix No. 1; DN 1; DNOCHP; SN 46; 2-Cyclohexyl-4,6-Dinitrophenol; 2,4-Dinitro-6-cyclohexylphenol; 4,6-Dinitro-o-cyclohexylphenol; Dinitro-o-cyclohexylphenol; Dinitrocyclohexylphenol; Dn dust no. 12; Dowspray 17; ENT 157; Pedinex; Phenol, 6-cyclohexyl-2,4-dinitro-; 2-Cyclohexyl-4,6-dinitrofenol; 6-Cicloesil-2,4-dinitr-fenolo; 6-Cyclohexyl-2,4-dinitrophenol; DN; NA 9026; Rcra waste number P034; DN (pesticide); NSC 403662

Phase change data

Data compiled as indicated in comments:
TRC - Thermodynamics Research Center, NIST Boulder Laboratories, Chris Muzny director
AC - William E. Acree, Jr., James S. Chickos
Quantity | Value | Units | Method | Reference | Comment |
---|---|---|---|---|---|
Tfus | 378.7 | K | N/A | Plato and Glasgow, 1969 | Uncertainty assigned by TRC = 0.2 K; TRC |
Enthalpy of vaporization
ΔvapH (kJ/mol) | Temperature (K) | Method | Reference | Comment |
---|---|---|---|---|
88.6 | 420. | A | Stephenson and Malanowski, 1987 | Based on data from 405. to 565. K. See also Stull, 1947.; AC |
Antoine Equation Parameters
log10(P) = A − (B / (T + C))
P = vapor pressure (bar)
T = temperature (K)
View plot Requires a JavaScript / HTML 5 canvas capable browser.
Temperature (K) | A | B | C | Reference | Comment |
---|---|---|---|---|---|
406.0 to 564.7 | 6.48343 | 3324.631 | -50.996 | Stull, 1947 | Coefficents calculated by NIST from author's data. |
Enthalpy of fusion
ΔfusH (kJ/mol) | Temperature (K) | Method | Reference | Comment |
---|---|---|---|---|
28.03 | 378.7 | DSC | Plato and Glasgow, 1969, 2 | AC |

References

Plato and Glasgow, 1969
Plato, C.; Glasgow, A.R., Jr.,
Differential scanning calorimetry as a general method for determining the purity and heat of fusion of high-purity organic chemicals. Application to 95 compounds,
Anal. Chem., 1969, 41, 2, 330, https://doi.org/10.1021/ac60271a041
. [all data]
Stephenson and Malanowski, 1987
Stephenson, Richard M.; Malanowski, Stanislaw,
Handbook of the Thermodynamics of Organic Compounds, 1987, https://doi.org/10.1007/978-94-009-3173-2
. [all data]
Stull, 1947
Stull, Daniel R.,
Vapor Pressure of Pure Substances. Organic and Inorganic Compounds,
Ind. Eng. Chem., 1947, 39, 4, 517-540, https://doi.org/10.1021/ie50448a022
. [all data]
Plato and Glasgow, 1969, 2
Plato, Candace.; Glasgow, Augustus R.,
Differential scanning calorimetry as a general method for determining the purity and heat of fusion of high-purity organic chemicals. Application to 95 compounds,
Anal. Chem., 1969, 41, 2, 330-336, https://doi.org/10.1021/ac60271a041
. [all data]