Phenol, 4-(ethoxymethyl)-2-methoxy-
- Formula: C10H14O3
- Molecular weight: 182.2164
- IUPAC Standard InChIKey: KOCVACNWDMSLBM-UHFFFAOYSA-N
- CAS Registry Number: 13184-86-6
- Chemical structure:
View 3d structure (requires JavaScript / HTML 5) - Other names: 4-(Ethoxymethyl)-2-methoxyphenol; Ethyl vanillyl ether; Vanillyl ethyl ether; Ethyl 4-hydroxy-3-methoxybenzyl ether

Van Den Dool and Kratz RI, non-polar column, temperature ramp

Column type | Active phase | I | Reference | Comment |
---|---|---|---|---|
Capillary | HP-5MS | 1553. | Lalel, Singh, et al., 2003 | 60. m/0.25 mm/0.25 μm, He, 40. C @ 1. min, 3. K/min, 310. C @ 20. min |

Van Den Dool and Kratz RI, non-polar column, custom temperature program

Column type | Active phase | I | Reference | Comment |
---|---|---|---|---|
Capillary | HP-5MS | 1466.2 | Andriamaharavo, 2014 | 30. m/0.25 mm/0.25 μm, He; Program: 60C (1 min) => 5 C/min => 210C => 10 C/min => 280C (15 min) |

Normal alkane RI, polar column, custom temperature program

Column type | Active phase | I | Reference | Comment |
---|---|---|---|---|
Capillary | Supelcowax-10 | 2941. | de Simon, Estruelas, et al., 2009 | 30. m/0.25 mm/0.25 μm, Helium; Program: 45 0C 3 0C/min -> 230 0C (10 min) 10 0C/min -> 270 0C (21 min) |

References

Lalel, Singh, et al., 2003
Lalel, H.J.D.; Singh, Z.; Chye Tan, S.,
Glycosidically-bound aroma volatile compounds in the skin and pulp of 'Kensington Pride' mango fruit at different stages of maturity,
Postharvest Biol. Technol., 2003, 29, 2, 205-218, https://doi.org/10.1016/S0925-5214(02)00250-8
. [all data]
Andriamaharavo, 2014
Andriamaharavo, N.R.,
Retention Data. NIST Mass Spectrometry Data Center., NIST Mass Spectrometry Data Center, 2014. [all data]
de Simon, Estruelas, et al., 2009
de Simon, B.F.; Estruelas, E.; Munoz, A.M.; Cadahia, E.; Sanz, M.,
Volatile compounds in acacia, chestnut, cherry, ash, and oak woods, with a view to their use in cooperage,
J. Agric. Food Chem., 2009, 57, 8, 3217-3227, https://doi.org/10.1021/jf803463h
. [all data]