2,2'-[oxybis(methylene)]bis[2-[(nitrooxy)methyl]propane-1,3-diyl] tetranitrate

Condensed phase thermochemistry data

Data compiled by: Hussein Y. Afeefy, Joel F. Liebman, and Stephen E. Stein

Quantity Value Units Method Reference Comment
Δfsolid-979.6 ± 5.4kJ/molCcbMedard and Thomas, 1955Reanalyzed by Cox and Pilcher, 1970, Original value = -956.5 kJ/mol
Quantity Value Units Method Reference Comment
Δcsolid-5250.5kJ/molCcbHandrick, 1956Stegeman, G. Univ. of Pittsburg 1945
Δcsolid-4936.3kJ/molCcbHandrick, 1956W. R. Tomlinson 1949
Δcsolid-5242.1 ± 5.4kJ/molCcbMedard and Thomas, 1955Reanalyzed by Cox and Pilcher, 1970, Original value = -5265.1 kJ/mol

References

Medard and Thomas, 1955
Medard, L.; Thomas, M., Chaleurs de combustion de treize substances explosives ou apparentees a des explosifs, Mem. Poudres, 1955, 38, 46-63. [all data]

Cox and Pilcher, 1970
Cox, J.D.; Pilcher, G., Thermochemistry of Organic and Organometallic Compounds, Academic Press, New York, 1970, 1-636. [all data]

Handrick, 1956
Handrick, G.R., Report of the study of pure explosive compounds. Part IV. Calculation of heat of combustion of organic compounds from structural features and calculation of power of high explosives, Rpt. C-58247 for the Office of the Chief of Ordnance, contract DA-19-020-ORD-47 by the Arthur D. Little, Inc., Cambridge, MA, 1956, 467-573. [all data]