Dipicrylamine

Condensed phase thermochemistry data

Data compiled by: Hussein Y. Afeefy, Joel F. Liebman, and Stephen E. Stein

Quantity Value Units Method Reference Comment
Δfsolid44.56kJ/molCcbMedard and Thomas, 1949Author's hf298_condensed=12.0 kcal/mol
Δfsolid76.27kJ/molCcbRinkenbach, 1930Author hf298_condensed[kcal/mol]=13.83
Quantity Value Units Method Reference Comment
Δcsolid-5481.29kJ/molCcbMedard and Thomas, 1949Author's hf298_condensed=12.0 kcal/mol
Δcsolid-5512.956kJ/molCcbRinkenbach, 1930Author hf298_condensed[kcal/mol]=13.83

References

Medard and Thomas, 1949
Medard, L.; Thomas, M., Determinations calorimetriques concernant dix-huit derives nitres ou nitrates organiques., Mem. Poudres, 1949, 29, 173-195. [all data]

Rinkenbach, 1930
Rinkenbach, W.H., The heats of combustion and formation of aromatic nitro compounds, J. Am. Chem. Soc., 1930, 52, 115-120. [all data]