Celestolide
- Formula: C17H24O
- Molecular weight: 244.3719
- IUPAC Standard InChIKey: IKTHMQYJOWTSJO-UHFFFAOYSA-N
- CAS Registry Number: 13171-00-1
- Chemical structure:
View 3d structure (requires JavaScript / HTML 5) - Other names: Ethanone, 1-[6-(1,1-dimethylethyl)-2,3-dihydro-1,1-dimethyl-1H-inden-4-yl]-; 4-Acetyl-6-tert-butyl-1,1-dimethyl indan; 1-(6-tert-Butyl-1,1-dimethyl-2,3-dihydro-1H-inden-4-yl)ethanone; Indane, 4-acetyl-1,1-dimethyl-6-(1,1-dimethylethyl); 6-tert-Butyl-1,1-dimethylindan-4-yl methyl ketone; 1-(6-tert-Butyl-1,1-dimethyl-2,3-dihydroinden-4-yl)ethanone

Kovats' RI, non-polar column, isothermal

Column type | Active phase | Temperature (C) | I | Reference | Comment |
---|---|---|---|---|---|
Capillary | SE-30 | 100. | 1705.1 | Tudor, 1997 | 40. m/0.35 mm/0.35 μm |

Normal alkane RI, non-polar column, custom temperature program

Column type | Active phase | I | Reference | Comment |
---|---|---|---|---|
Capillary | SE-30 | 1706. | Vinogradov, 2004 | Program: not specified |

Normal alkane RI, polar column, custom temperature program

Column type | Active phase | I | Reference | Comment |
---|---|---|---|---|
Capillary | Carbowax 20M | 2145. | Vinogradov, 2004 | Program: not specified |

References

Tudor, 1997
Tudor, E.,
Temperature dependence of the retention index for perfumery compounds on a SE-30 glass capillary column. I. Linear equations,
J. Chromatogr. A, 1997, 779, 1-2, 287-297, https://doi.org/10.1016/S0021-9673(97)00453-6
. [all data]
Vinogradov, 2004
Vinogradov, B.A.,
Production, composition, properties and application of essential oils, 2004, retrieved from http://viness.narod.ru. [all data]