Triisopropylsilyl chloride
- Formula: C9H21ClSi
- Molecular weight: 192.802
- IUPAC Standard InChIKey: KQIADDMXRMTWHZ-UHFFFAOYSA-N
- CAS Registry Number: 13154-24-0
- Chemical structure:
View 3d structure (requires JavaScript / HTML 5) - Other names: Triisopropylchlorosilane; Silane, chlorotris(1-methylethyl)-

Phase change data

Data compiled by: Robert L. Brown and Stephen E. Stein
Reduced pressure boiling point
Tboil (K) | Pressure (bar) | Reference |
---|---|---|
353. | 0.013 | Farchan Laboratories, 1990 |

References

Farchan Laboratories, 1990
Farchan Laboratories,
Research Chemicals Catalog, Farchan Laboratories, Gainesville, FL, 1990, 91. [all data]