Cyclooctane, ethyl-
- Formula: C10H20
- Molecular weight: 140.2658
- IUPAC Standard InChIKey: FBGUQAGGWLRXTP-UHFFFAOYSA-N
- CAS Registry Number: 13152-02-8
- Chemical structure:
View 3d structure (requires JavaScript / HTML 5) - Other names: Ethylcyclooctane

Phase change data

Data compiled by: Thermodynamics Research Center, NIST Boulder Laboratories, Chris Muzny director
Quantity | Value | Units | Method | Reference | Comment |
---|---|---|---|---|---|
Tboil | 464.55 | K | N/A | Craig and Larrab, 1951 | Uncertainty assigned by TRC = 2. K |

Kovats' RI, non-polar column, isothermal

View large format table.

Column type Active phase Temperature (C) I Reference Comment
CapillarySqualane70.1092.Schomburg, 1966
CapillarySqualane80.1092.Schomburg, 1966

Normal alkane RI, non-polar column, custom temperature program

View large format table.

Column type Active phase I Reference Comment
CapillarySqualane1092.Chen, 2008Program: not specified

References

Craig and Larrab, 1951
Craig, L.E.; Larrab, C.E.,
J. Am. Chem. Soc., 1951, 73, 1191. [all data]