Cyclooctane, 1,4-dimethyl-, trans-
- Formula: C10H20
- Molecular weight: 140.2658
- IUPAC Standard InChIKey: GUOSBMCHCJXBMH-UWVGGRQHSA-N
- CAS Registry Number: 13151-98-9
- Chemical structure:
View 3d structure (requires JavaScript / HTML 5) - Stereoisomers:
- Other names: trans-1,4-Dimethylcyclooctane; (E)-1,4-Dimethylcyclooctane

Kovats' RI, non-polar column, isothermal

Column type | Active phase | Temperature (C) | I | Reference | Comment |
---|---|---|---|---|---|
Capillary | Squalane | 70. | 1052. | Schomburg, 1966 |

References

Schomburg, 1966
Schomburg, G.,
Gaschromatographische Retentionsdaten und struktur chemischer verbindungen. III. Alkylverzweigte und ungesättigte cyclische Kohlenwasserstoffe,
J. Chromatogr., 1966, 23, 18-41, https://doi.org/10.1016/S0021-9673(01)98653-4
. [all data]