Cyclooctane, 1,2-dimethyl-
- Formula: C10H20
- Molecular weight: 140.2658
- IUPAC Standard InChIKey: OJGUADSLWNGMCA-UHFFFAOYSA-N
- CAS Registry Number: 13151-94-5
- Chemical structure:
View 3d structure (requires JavaScript / HTML 5) - Stereoisomers:
- Other names: 1,2-dimethylcyclooctane

Normal alkane RI, non-polar column, custom temperature program

Column type | Active phase | I | Reference | Comment |
---|---|---|---|---|
Capillary | Squalane | 1069. | Chen, 2008 | Program: not specified |

References

Chen, 2008
Chen, H.-F.,
Quantitative prediction of gas chromatography retention indices with support vector machines, radial basis neutral networks and multiple linear regression,
Anal. Chim. Acta, 2008, 609, 1, 24-36, https://doi.org/10.1016/j.aca.2008.01.003
. [all data]