Dodecane, 5-cyclohexyl-
- Formula: C18H36
- Molecular weight: 252.4784
- IUPAC Standard InChIKey: KBVIBWSEPXLFGZ-UHFFFAOYSA-N
- CAS Registry Number: 13151-85-4
- Chemical structure:

Kovats' RI, non-polar column, isothermal

Column type | Active phase | Temperature (C) | I | Reference | Comment |
---|---|---|---|---|---|
Capillary | Apiezon | 200. | 1768. | Schomburg, 1966 |

References

Schomburg, 1966
Schomburg, G.,
Gaschromatographische Retentionsdaten und struktur chemischer verbindungen. III. Alkylverzweigte und ungesättigte cyclische Kohlenwasserstoffe,
J. Chromatogr., 1966, 23, 18-41, https://doi.org/10.1016/S0021-9673(01)98653-4
. [all data]