Cycloheptane, ethyl-
- Formula: C9H18
- Molecular weight: 126.2392
- IUPAC Standard InChIKey: ITZHTNFXLDFAPB-UHFFFAOYSA-N
- CAS Registry Number: 13151-55-8
- Chemical structure:
View 3d structure (requires JavaScript / HTML 5) - Other names: ethyl-cycloheptane

Kovats' RI, non-polar column, isothermal

Column type | Active phase | Temperature (C) | I | Reference | Comment |
---|---|---|---|---|---|
Capillary | Squalane | 100. | 973. | Mitra, Mohan, et al., 1974 | H2; Column length: 50. m; Column diameter: 0.2 mm |
Capillary | Squalane | 70. | 969. | Schomburg, 1966 | |
Capillary | Squalane | 80. | 969. | Schomburg, 1966 |

References

Mitra, Mohan, et al., 1974
Mitra, G.D.; Mohan, G.; Sinha, A.,
Gas chromatographic analysis of complex hydrocarbon mixtures,
J. Chromatogr. A, 1974, 91, 633-648, https://doi.org/10.1016/S0021-9673(01)97944-0
. [all data]
Schomburg, 1966
Schomburg, G.,
Gaschromatographische Retentionsdaten und struktur chemischer verbindungen. III. Alkylverzweigte und ungesättigte cyclische Kohlenwasserstoffe,
J. Chromatogr., 1966, 23, 18-41, https://doi.org/10.1016/S0021-9673(01)98653-4
. [all data]