Cyclodecane, methyl-
- Formula: C11H22
- Molecular weight: 154.2924
- IUPAC Standard InChIKey: WFWNFBYXZQJMFM-UHFFFAOYSA-N
- CAS Registry Number: 13151-43-4
- Chemical structure:
View 3d structure (requires JavaScript / HTML 5) - Other names: Methylcyclodecane

Kovats' RI, non-polar column, isothermal

Column type | Active phase | Temperature (C) | I | Reference | Comment |
---|---|---|---|---|---|
Capillary | Squalane | 100. | 1195. | Schomburg, 1967 | Ar; Column length: 100. m |
Capillary | Squalane | 120. | 1202. | Schomburg, 1966 |

References

Schomburg, 1967
Schomburg, G.,
Struktur und Retentionsverhalten von Offenkettigen und Cyclischen Kohlenwasserstoffen und Deren Einfacher Substitutionsprodukte,
Anal. Chim. Acta., 1967, 38, 45-64, https://doi.org/10.1016/S0003-2670(01)80560-2
. [all data]
Schomburg, 1966
Schomburg, G.,
Gaschromatographische Retentionsdaten und struktur chemischer verbindungen. III. Alkylverzweigte und ungesättigte cyclische Kohlenwasserstoffe,
J. Chromatogr., 1966, 23, 18-41, https://doi.org/10.1016/S0021-9673(01)98653-4
. [all data]