Decane, 5-methyl-
- Formula: C11H24
- Molecular weight: 156.3083
- IUPAC Standard InChIKey: QUYFPNWYGLFQQU-UHFFFAOYSA-N
- CAS Registry Number: 13151-35-4
- Chemical structure:
View 3d structure (requires JavaScript / HTML 5) - Other names: 5-Methyldecane

Phase change data

Data compiled by: William E. Acree, Jr., James S. Chickos
Enthalpy of vaporization
ΔvapH (kJ/mol) | Temperature (K) | Method | Reference | Comment |
---|---|---|---|---|
46.0 | 349. | A | Stephenson and Malanowski, 1987 | Based on data from 334. to 452. K. |

Van Den Dool and Kratz RI, non-polar column, temperature ramp

Data compiled by: NIST Mass Spectrometry Data Center, William E. Wallace, director

Column type CapillaryCapillaryCapillaryCapillaryCapillary
Active phase Petrocol DHOV-101Cross-Linked MethylsiliconeUltra-1Ultra-1
Column length (m) 50.80. 50.50.
Carrier gas HeN2 HeHe
Substrate
Column diameter (mm) 0.250.22 0.220.22
Phase thickness (μm) 0.5  0.330.33
Tstart (C) 35.30.40.-30.-30.
Tend (C) 200.130.300.240.240.
Heat rate (K/min) 3.1.5.1.2.
Initial hold (min) 10.
Final hold (min) 10.
I 1058.31057.41058.1059.031058.91
ReferenceCensullo, Jones, et al., 2003Yin, Liu, et al., 2001Khorasheh, Gray, et al., 1989Haynes and Pitzer, 1985Haynes and Pitzer, 1985
Comment MSDC-RI MSDC-RI MSDC-RI MSDC-RI MSDC-RI
Column type CapillaryCapillaryCapillaryCapillary
Active phase Ultra-1Ultra-2Ultra-2Ultra-2
Column length (m) 50.50.50.50.
Carrier gas HeHeHeHe
Substrate
Column diameter (mm) 0.220.220.220.22
Phase thickness (μm) 0.330.330.330.33
Tstart (C) -30.-30.-30.-30.
Tend (C) 240.240.240.240.
Heat rate (K/min) 3.1.2.3.
Initial hold (min)
Final hold (min)
I 1059.061058.231058.151058.28
ReferenceHaynes and Pitzer, 1985Haynes and Pitzer, 1985Haynes and Pitzer, 1985Haynes and Pitzer, 1985
Comment MSDC-RI MSDC-RI MSDC-RI MSDC-RI

References

Stephenson and Malanowski, 1987
Stephenson, Richard M.; Malanowski, Stanislaw,
Handbook of the Thermodynamics of Organic Compounds, 1987, https://doi.org/10.1007/978-94-009-3173-2
. [all data]