ditantalum pentaoxide
- Formula: O5Ta2
- Molecular weight: 441.8928
- CAS Registry Number: 1314-61-0

Condensed phase thermochemistry data

Quantity | Value | Units | Method | Reference | Comment |
---|---|---|---|---|---|
ΔfH°liquid | -1957.18 | kJ/mol | Review | Chase, 1998 | Data last reviewed in December, 1972 |
Quantity | Value | Units | Method | Reference | Comment |
S°liquid,1 bar | 183.08 | J/mol*K | Review | Chase, 1998 | Data last reviewed in December, 1972 |
Quantity | Value | Units | Method | Reference | Comment |
ΔfH°solid | -2045.98 | kJ/mol | Review | Chase, 1998 | Data last reviewed in December, 1972 |
Quantity | Value | Units | Method | Reference | Comment |
S°solid | 142.86 | J/mol*K | Review | Chase, 1998 | Data last reviewed in December, 1972 |
Liquid Phase Heat Capacity (Shomate Equation)
Cp° = A + B*t + C*t2 + D*t3 +
E/t2
H° − H°298.15= A*t + B*t2/2 +
C*t3/3 + D*t4/4 − E/t + F − H
S° = A*ln(t) + B*t + C*t2/2 + D*t3/3 −
E/(2*t2) + G
Cp = heat capacity (J/mol*K)
H° = standard enthalpy (kJ/mol)
S° = standard entropy (J/mol*K)
t = temperature (K) / 1000.
View plot Requires a JavaScript / HTML 5 canvas capable browser.
Temperature (K) | 2058. to 5000. |
---|---|
A | 242.6724 |
B | -4.766455×10-8 |
C | 1.226130×10-8 |
D | -1.061924×10-9 |
E | -4.051304×10-8 |
F | -2106.535 |
G | 357.8563 |
H | -1957.175 |
Reference | Chase, 1998 |
Comment | Data last reviewed in December, 1972 |
Solid Phase Heat Capacity (Shomate Equation)
Cp° = A + B*t + C*t2 + D*t3 +
E/t2
H° − H°298.15= A*t + B*t2/2 +
C*t3/3 + D*t4/4 − E/t + F − H
S° = A*ln(t) + B*t + C*t2/2 + D*t3/3 −
E/(2*t2) + G
Cp = heat capacity (J/mol*K)
H° = standard enthalpy (kJ/mol)
S° = standard entropy (J/mol*K)
t = temperature (K) / 1000.
View plot Requires a JavaScript / HTML 5 canvas capable browser.
Temperature (K) | 298. to 2058. |
---|---|
A | 131.9759 |
B | 80.02737 |
C | -33.89676 |
D | 5.280459 |
E | -1.625722 |
F | -2094.125 |
G | 271.0261 |
H | -2045.976 |
Reference | Chase, 1998 |
Comment | Data last reviewed in December, 1972 |

Reaction thermochemistry data

Data compiled by: José A. Martinho Simões
Individual Reactions
C5H15Ta (l) + 2.5 (l) = 0.5O5Ta2 (cr) + 5
(g)
By formula: C5H15Ta (l) + 2.5H2O (l) = 0.5O5Ta2 (cr) + 5CH4 (g)
Quantity | Value | Units | Method | Reference | Comment |
---|---|---|---|---|---|
ΔrH° | -853. ± 26. | kJ/mol | RSC | Adedeji, Connor J.A., et al., 1976 |

References

Chase, 1998
Chase, M.W., Jr.,
NIST-JANAF Themochemical Tables, Fourth Edition,
J. Phys. Chem. Ref. Data, Monograph 9, 1998, 1-1951. [all data]
Adedeji, Connor J.A., et al., 1976
Adedeji, F.A.; Connor J.A.; Skinner, H.A.; Galyer, L.; Wilkinson, G.,
J. Chem. Soc., Chem. Commun., 1976, 159.. [all data]