zinc oxide
- Formula: OZn
- Molecular weight: 81.38
- IUPAC Standard InChIKey: XLOMVQKBTHCTTD-UHFFFAOYSA-N
- CAS Registry Number: 1314-13-2
- Chemical structure:
View 3d structure (requires JavaScript / HTML 5) - Species with the same structure:

Condensed phase thermochemistry data

Quantity | Value | Units | Method | Reference | Comment |
---|---|---|---|---|---|
ΔfH°solid | -350.46 ± 0.27 | kJ/mol | Review | Cox, Wagman, et al., 1984 | CODATA Review value |
Quantity | Value | Units | Method | Reference | Comment |
S°solid,1 bar | 43.65 ± 0.40 | J/mol*K | Review | Cox, Wagman, et al., 1984 | CODATA Review value |

Gas phase ion energetics data

Data compiled by: John E. Bartmess
Electron affinity determinations
EA (eV) | Method | Reference | Comment |
---|---|---|---|
2.077 ± 0.020 | LPES | Kim, Li, et al., 2001 | |
2.0870 ± 0.0080 | LPES | Moravec, Klopcic, et al., 2001 | |
2.088 ± 0.010 | LPES | Fancher, deClercq, et al., 1998 |

References

Cox, Wagman, et al., 1984
Cox, J.D.; Wagman, D.D.; Medvedev, V.A.,
CODATA Key Values for Thermodynamics, Hemisphere Publishing Corp., New York, 1984, 1. [all data]
Kim, Li, et al., 2001
Kim, J.H.; Li, X.; Wang, L.S.; de Clercq, H.L.; Fancher, C.A.; Thomas, O.C.; Bowen, K.H.,
Vibrationally resolved photoelectron spectroscopy of MgO- and ZnO- and the low-lying electronic states of MgO, MgO-, and ZnO,
J. Phys. Chem. A, 2001, 105, 23, 5709-5718, https://doi.org/10.1021/jp010331d
. [all data]
Moravec, Klopcic, et al., 2001
Moravec, V.D.; Klopcic, S.A.; Chatterjee, B.; Jarrold, C.C.,
The electronic structure of ZnO and ZnF determined by anion photoelectron spectroscopy,
Chem. Phys., 2001, 341, 313-318. [all data]
Fancher, deClercq, et al., 1998
Fancher, C.A.; deClercq, H.L.; Thomas, O.C.; Robinson, D.W.; Bowen, K.H.,
Zinc oxide and its anion: A negative ion photoelectron spectroscopic study,
J. Chem. Phys., 1998, 109, 19, 8426-8429, https://doi.org/10.1063/1.477505
. [all data]