Urea, N-(2-methylphenyl)-N'-phenyl-
- Formula: C14H14N2O
- Molecular weight: 226.2738
- IUPAC Standard InChIKey: UUIQRZTUWPSQKW-UHFFFAOYSA-N
- CAS Registry Number: 13140-49-3
- Chemical structure:
View 3d structure (requires JavaScript / HTML 5) - Other names: Carbanilide, 2-methyl-

Reaction thermochemistry data

Data compiled by: Hussein Y. Afeefy, Joel F. Liebman, and Stephen E. Stein
Individual Reactions
By formula: C7H5NO + C7H9N = C14H14N2O
Quantity | Value | Units | Method | Reference | Comment |
---|---|---|---|---|---|
ΔrH° | -93.0 | kJ/mol | Cm | Pannone and Macosko, 1987 | liquid phase |

References

Pannone and Macosko, 1987
Pannone, M.C.; Macosko, C.W.,
Kinetics of isocyanate amine reactions,
J. Appl. Polym. Sci., 1987, 34, 2409-2432. [all data]