thiophenoxide anion
- Formula: C6H5S-
- Molecular weight: 109.169
- IUPAC Standard InChIKey: RMVRSNDYEFQCLF-UHFFFAOYSA-M
- CAS Registry Number: 13133-62-5
- Chemical structure:
View 3d structure (requires JavaScript / HTML 5) - Permanent link for this species. Use this link for bookmarking this species for future reference.

Reaction thermochemistry data

Data compiled as indicated in comments:
B - John E. Bartmess
M - Michael M. Meot-Ner (Mautner) and Sharon G. Lias
Individual Reactions
By formula: C6H5S- + H+ = C6H6S
Quantity | Value | Units | Method | Reference | Comment |
---|---|---|---|---|---|
ΔrH° | 1424. ± 8.8 | kJ/mol | G+TS | Taft and Bordwell, 1988 | gas phase; B |
ΔrH° | >1423. ± 7.5 | kJ/mol | D-EA | Richardson, Stephenson, et al., 1975 | gas phase; B |
Quantity | Value | Units | Method | Reference | Comment |
ΔrG° | 1395. ± 8.8 | kJ/mol | IMRE | Guillemin, Riague, et al., 2005 | gas phase; B |
ΔrG° | 1397. ± 8.4 | kJ/mol | IMRE | Taft and Bordwell, 1988 | gas phase; B |
ΔrG° | >1395. ± 7.9 | kJ/mol | H-TS | Richardson, Stephenson, et al., 1975 | gas phase; B |
+
= C6H7OS-
By formula: C6H5S- + H2O = C6H7OS-
Quantity | Value | Units | Method | Reference | Comment |
---|---|---|---|---|---|
ΔrH° | 47.70 ± 0.84 | kJ/mol | TDAs | Sieck and Meot-ner, 1989 | gas phase; B |
Quantity | Value | Units | Method | Reference | Comment |
ΔrG° | 23.4 ± 2.9 | kJ/mol | TDAs | Sieck and Meot-ner, 1989 | gas phase; B |
+
= C8H9O2S-
By formula: C6H5S- + C2H4O2 = C8H9O2S-
Quantity | Value | Units | Method | Reference | Comment |
---|---|---|---|---|---|
ΔrH° | 84.94 ± 0.42 | kJ/mol | TDAs | Sieck and Meot-ner, 1989 | gas phase; B |
Quantity | Value | Units | Method | Reference | Comment |
ΔrG° | 52.3 ± 1.7 | kJ/mol | TDAs | Sieck and Meot-ner, 1989 | gas phase; B |
+
= C8H8F3OS-
By formula: C6H5S- + C2H3F3O = C8H8F3OS-
Quantity | Value | Units | Method | Reference | Comment |
---|---|---|---|---|---|
ΔrH° | 87.86 ± 0.84 | kJ/mol | TDAs | Sieck and Meot-ner, 1989 | gas phase; B |
Quantity | Value | Units | Method | Reference | Comment |
ΔrG° | 56.5 ± 2.5 | kJ/mol | TDAs | Sieck and Meot-ner, 1989 | gas phase; B |
+
= C7H9OS-
By formula: C6H5S- + CH4O = C7H9OS-
Quantity | Value | Units | Method | Reference | Comment |
---|---|---|---|---|---|
ΔrH° | 56.07 ± 0.42 | kJ/mol | TDAs | Sieck and Meot-ner, 1989 | gas phase; B |
Quantity | Value | Units | Method | Reference | Comment |
ΔrG° | 27.2 ± 1.3 | kJ/mol | TDAs | Sieck and Meot-ner, 1989 | gas phase; B |
+
= C9H13OS-
By formula: C6H5S- + C3H8O = C9H13OS-
Quantity | Value | Units | Method | Reference | Comment |
---|---|---|---|---|---|
ΔrH° | 62.76 ± 0.42 | kJ/mol | TDAs | Sieck and Meot-ner, 1989 | gas phase; B |
Quantity | Value | Units | Method | Reference | Comment |
ΔrG° | 30.5 ± 1.7 | kJ/mol | TDAs | Sieck and Meot-ner, 1989 | gas phase; B |
+
= C10H15OS-
By formula: C6H5S- + C4H10O = C10H15OS-
Quantity | Value | Units | Method | Reference | Comment |
---|---|---|---|---|---|
ΔrH° | 61.09 ± 0.42 | kJ/mol | TDAs | Sieck and Meot-ner, 1989 | gas phase; B |
Quantity | Value | Units | Method | Reference | Comment |
ΔrG° | 30.1 ± 2.1 | kJ/mol | TDAs | Sieck and Meot-ner, 1989 | gas phase; B |
+
= C9H11O2S-
By formula: C6H5S- + C3H6O2 = C9H11O2S-
Quantity | Value | Units | Method | Reference | Comment |
---|---|---|---|---|---|
ΔrH° | 83.7 ± 1.7 | kJ/mol | TDAs | Sieck and Meot-ner, 1989 | gas phase; B |
Quantity | Value | Units | Method | Reference | Comment |
ΔrG° | 51.9 ± 5.4 | kJ/mol | TDAs | Sieck and Meot-ner, 1989 | gas phase; B |
By formula: C6H5S- + H2O = (C6H5S- • H2O)
Quantity | Value | Units | Method | Reference | Comment |
---|---|---|---|---|---|
ΔrH° | 47.7 | kJ/mol | PHPMS | Sieck and Meot-ner, 1989 | gas phase; M |
Quantity | Value | Units | Method | Reference | Comment |
ΔrS° | 82.0 | J/mol*K | PHPMS | Sieck and Meot-ner, 1989 | gas phase; M |
By formula: C6H5S- + C3H6O2 = (C6H5S- • C3H6O2)
Quantity | Value | Units | Method | Reference | Comment |
---|---|---|---|---|---|
ΔrH° | 83.7 | kJ/mol | PHPMS | Sieck and Meot-ner, 1989 | gas phase; M |
Quantity | Value | Units | Method | Reference | Comment |
ΔrS° | 107. | J/mol*K | PHPMS | Sieck and Meot-ner, 1989 | gas phase; M |
By formula: C6H5S- + C2H4O2 = (C6H5S- • C2H4O2)
Quantity | Value | Units | Method | Reference | Comment |
---|---|---|---|---|---|
ΔrH° | 84.9 | kJ/mol | PHPMS | Sieck and Meot-ner, 1989 | gas phase; M |
Quantity | Value | Units | Method | Reference | Comment |
ΔrS° | 110. | J/mol*K | PHPMS | Sieck and Meot-ner, 1989 | gas phase; M |
By formula: C6H5S- + CH4O = (C6H5S- • CH4O)
Quantity | Value | Units | Method | Reference | Comment |
---|---|---|---|---|---|
ΔrH° | 56.1 | kJ/mol | PHPMS | Sieck and Meot-ner, 1989 | gas phase; M |
Quantity | Value | Units | Method | Reference | Comment |
ΔrS° | 96.2 | J/mol*K | PHPMS | Sieck and Meot-ner, 1989 | gas phase; M |
By formula: C6H5S- + C3H8O = (C6H5S- • C3H8O)
Quantity | Value | Units | Method | Reference | Comment |
---|---|---|---|---|---|
ΔrH° | 62.8 | kJ/mol | PHPMS | Sieck and Meot-ner, 1989 | gas phase; M |
Quantity | Value | Units | Method | Reference | Comment |
ΔrS° | 109. | J/mol*K | PHPMS | Sieck and Meot-ner, 1989 | gas phase; M |
By formula: C6H5S- + C4H10O = (C6H5S- • C4H10O)
Quantity | Value | Units | Method | Reference | Comment |
---|---|---|---|---|---|
ΔrH° | 61.1 | kJ/mol | PHPMS | Sieck and Meot-ner, 1989 | gas phase; M |
Quantity | Value | Units | Method | Reference | Comment |
ΔrS° | 105. | J/mol*K | PHPMS | Sieck and Meot-ner, 1989 | gas phase; M |
By formula: C6H5S- + C2H3F3O = (C6H5S- • C2H3F3O)
Quantity | Value | Units | Method | Reference | Comment |
---|---|---|---|---|---|
ΔrH° | 87.9 | kJ/mol | PHPMS | Sieck and Meot-ner, 1989 | gas phase; M |
Quantity | Value | Units | Method | Reference | Comment |
ΔrS° | 105. | J/mol*K | PHPMS | Sieck and Meot-ner, 1989 | gas phase; M |

Gas phase ion energetics data

Data compiled by: John E. Bartmess
Protonation reactions
By formula: C6H5S- + H+ = C6H6S
Quantity | Value | Units | Method | Reference | Comment |
---|---|---|---|---|---|
ΔrH° | 1424. ± 8.8 | kJ/mol | G+TS | Taft and Bordwell, 1988 | gas phase |
ΔrH° | >1423. ± 7.5 | kJ/mol | D-EA | Richardson, Stephenson, et al., 1975 | gas phase |
Quantity | Value | Units | Method | Reference | Comment |
ΔrG° | 1395. ± 8.8 | kJ/mol | IMRE | Guillemin, Riague, et al., 2005 | gas phase |
ΔrG° | 1397. ± 8.4 | kJ/mol | IMRE | Taft and Bordwell, 1988 | gas phase |
ΔrG° | >1395. ± 7.9 | kJ/mol | H-TS | Richardson, Stephenson, et al., 1975 | gas phase |

Ion clustering data

Data compiled as indicated in comments:
M - Michael M. Meot-Ner (Mautner) and Sharon G. Lias
B - John E. Bartmess
Clustering reactions
By formula: C6H5S- + CH4O = (C6H5S- • CH4O)
Quantity | Value | Units | Method | Reference | Comment |
---|---|---|---|---|---|
ΔrH° | 56.1 | kJ/mol | PHPMS | Sieck and Meot-ner, 1989 | gas phase; M |
Quantity | Value | Units | Method | Reference | Comment |
ΔrS° | 96.2 | J/mol*K | PHPMS | Sieck and Meot-ner, 1989 | gas phase; M |
+
= C7H9OS-
By formula: C6H5S- + CH4O = C7H9OS-
Quantity | Value | Units | Method | Reference | Comment |
---|---|---|---|---|---|
ΔrH° | 56.07 ± 0.42 | kJ/mol | TDAs | Sieck and Meot-ner, 1989 | gas phase; B |
Quantity | Value | Units | Method | Reference | Comment |
ΔrG° | 27.2 ± 1.3 | kJ/mol | TDAs | Sieck and Meot-ner, 1989 | gas phase; B |
By formula: C6H5S- + C2H3F3O = (C6H5S- • C2H3F3O)
Quantity | Value | Units | Method | Reference | Comment |
---|---|---|---|---|---|
ΔrH° | 87.9 | kJ/mol | PHPMS | Sieck and Meot-ner, 1989 | gas phase; M |
Quantity | Value | Units | Method | Reference | Comment |
ΔrS° | 105. | J/mol*K | PHPMS | Sieck and Meot-ner, 1989 | gas phase; M |
+
= C8H8F3OS-
By formula: C6H5S- + C2H3F3O = C8H8F3OS-
Quantity | Value | Units | Method | Reference | Comment |
---|---|---|---|---|---|
ΔrH° | 87.86 ± 0.84 | kJ/mol | TDAs | Sieck and Meot-ner, 1989 | gas phase; B |
Quantity | Value | Units | Method | Reference | Comment |
ΔrG° | 56.5 ± 2.5 | kJ/mol | TDAs | Sieck and Meot-ner, 1989 | gas phase; B |
By formula: C6H5S- + C2H4O2 = (C6H5S- • C2H4O2)
Quantity | Value | Units | Method | Reference | Comment |
---|---|---|---|---|---|
ΔrH° | 84.9 | kJ/mol | PHPMS | Sieck and Meot-ner, 1989 | gas phase; M |
Quantity | Value | Units | Method | Reference | Comment |
ΔrS° | 110. | J/mol*K | PHPMS | Sieck and Meot-ner, 1989 | gas phase; M |
+
= C8H9O2S-
By formula: C6H5S- + C2H4O2 = C8H9O2S-
Quantity | Value | Units | Method | Reference | Comment |
---|---|---|---|---|---|
ΔrH° | 84.94 ± 0.42 | kJ/mol | TDAs | Sieck and Meot-ner, 1989 | gas phase; B |
Quantity | Value | Units | Method | Reference | Comment |
ΔrG° | 52.3 ± 1.7 | kJ/mol | TDAs | Sieck and Meot-ner, 1989 | gas phase; B |
+
= C9H11O2S-
By formula: C6H5S- + C3H6O2 = C9H11O2S-
Quantity | Value | Units | Method | Reference | Comment |
---|---|---|---|---|---|
ΔrH° | 83.7 ± 1.7 | kJ/mol | TDAs | Sieck and Meot-ner, 1989 | gas phase; B |
Quantity | Value | Units | Method | Reference | Comment |
ΔrG° | 51.9 ± 5.4 | kJ/mol | TDAs | Sieck and Meot-ner, 1989 | gas phase; B |
By formula: C6H5S- + C3H6O2 = (C6H5S- • C3H6O2)
Quantity | Value | Units | Method | Reference | Comment |
---|---|---|---|---|---|
ΔrH° | 83.7 | kJ/mol | PHPMS | Sieck and Meot-ner, 1989 | gas phase; M |
Quantity | Value | Units | Method | Reference | Comment |
ΔrS° | 107. | J/mol*K | PHPMS | Sieck and Meot-ner, 1989 | gas phase; M |
+
= C9H13OS-
By formula: C6H5S- + C3H8O = C9H13OS-
Quantity | Value | Units | Method | Reference | Comment |
---|---|---|---|---|---|
ΔrH° | 62.76 ± 0.42 | kJ/mol | TDAs | Sieck and Meot-ner, 1989 | gas phase; B |
Quantity | Value | Units | Method | Reference | Comment |
ΔrG° | 30.5 ± 1.7 | kJ/mol | TDAs | Sieck and Meot-ner, 1989 | gas phase; B |
By formula: C6H5S- + C3H8O = (C6H5S- • C3H8O)
Quantity | Value | Units | Method | Reference | Comment |
---|---|---|---|---|---|
ΔrH° | 62.8 | kJ/mol | PHPMS | Sieck and Meot-ner, 1989 | gas phase; M |
Quantity | Value | Units | Method | Reference | Comment |
ΔrS° | 109. | J/mol*K | PHPMS | Sieck and Meot-ner, 1989 | gas phase; M |
By formula: C6H5S- + C4H10O = (C6H5S- • C4H10O)
Quantity | Value | Units | Method | Reference | Comment |
---|---|---|---|---|---|
ΔrH° | 61.1 | kJ/mol | PHPMS | Sieck and Meot-ner, 1989 | gas phase; M |
Quantity | Value | Units | Method | Reference | Comment |
ΔrS° | 105. | J/mol*K | PHPMS | Sieck and Meot-ner, 1989 | gas phase; M |
+
= C10H15OS-
By formula: C6H5S- + C4H10O = C10H15OS-
Quantity | Value | Units | Method | Reference | Comment |
---|---|---|---|---|---|
ΔrH° | 61.09 ± 0.42 | kJ/mol | TDAs | Sieck and Meot-ner, 1989 | gas phase; B |
Quantity | Value | Units | Method | Reference | Comment |
ΔrG° | 30.1 ± 2.1 | kJ/mol | TDAs | Sieck and Meot-ner, 1989 | gas phase; B |
By formula: C6H5S- + H2O = (C6H5S- • H2O)
Quantity | Value | Units | Method | Reference | Comment |
---|---|---|---|---|---|
ΔrH° | 47.7 | kJ/mol | PHPMS | Sieck and Meot-ner, 1989 | gas phase; M |
Quantity | Value | Units | Method | Reference | Comment |
ΔrS° | 82.0 | J/mol*K | PHPMS | Sieck and Meot-ner, 1989 | gas phase; M |
+
= C6H7OS-
By formula: C6H5S- + H2O = C6H7OS-
Quantity | Value | Units | Method | Reference | Comment |
---|---|---|---|---|---|
ΔrH° | 47.70 ± 0.84 | kJ/mol | TDAs | Sieck and Meot-ner, 1989 | gas phase; B |
Quantity | Value | Units | Method | Reference | Comment |
ΔrG° | 23.4 ± 2.9 | kJ/mol | TDAs | Sieck and Meot-ner, 1989 | gas phase; B |

References

Taft and Bordwell, 1988
Taft, R.W.; Bordwell, F.G.,
Structural and Solvent Effects Evaluated from Acidities Measured in Dimethyl Sulfoxide and in the Gas Phase,
Acc. Chem. Res., 1988, 21, 12, 463, https://doi.org/10.1021/ar00156a005
. [all data]
Richardson, Stephenson, et al., 1975
Richardson, J.H.; Stephenson, L.M.; Brauman, J.I.,
Photodetachment of electrons from phenoxides and thiophenoxide,
J. Am. Chem. Soc., 1975, 97, 2967. [all data]
Guillemin, Riague, et al., 2005
Guillemin, J.C.; Riague, E.H.; Gal, J.F.; Maria, P.C.; Mo, O.; Yanez, M.,
Acidity trends in alpha,beta-unsaturated sulfur, selenium, and tellurium derivatives: Comparison with C-, Si-, Ge-, Sn-, N-, P-, As-, and Sb-containing analogues,
Chem. Eur. J., 2005, 11, 7, 2145-2153, https://doi.org/10.1002/chem.200400989
. [all data]
Sieck and Meot-ner, 1989
Sieck, L.W.; Meot-ner, M.,
Ionic Hydrogen Bond and Ion Solvation. 8. RS-..HOR Bond Strengths. Correlation with Acidities.,
J. Phys. Chem., 1989, 93, 4, 1586, https://doi.org/10.1021/j100341a079
. [all data]