Bis-(4-(2,5-dioxo-2,5-dihydropyrrol-1-yl)-phenyl)-ether
- Formula: C20H12N2O5
- Molecular weight: 360.3197
- IUPAC Standard InChIKey: XOJRVZIYCCJCRD-UHFFFAOYSA-N
- CAS Registry Number: 13132-94-0
- Chemical structure:
View 3d structure (requires JavaScript / HTML 5) - Other names: p,p'-Oxybis(phenyl-N-maleimide)

Reaction thermochemistry data

Data compiled by: Hussein Y. Afeefy, Joel F. Liebman, and Stephen E. Stein
Individual Reactions
+
= C40H26N2O6
By formula: C20H12N2O5 + C20H14O = C40H26N2O6
Quantity | Value | Units | Method | Reference | Comment |
---|---|---|---|---|---|
ΔrH° | -105. | kJ/mol | Cm | Adigezalov, Kiselev, et al., 1991 | liquid phase; solvent: Dioxane |

References

Adigezalov, Kiselev, et al., 1991
Adigezalov, N.R.; Kiselev, V.D.; Konovalov, A.I.,
Bis-reagents in Diels-Alder reactions. V. Kinetics and thermochemistry of reactions of N,N'-bis(dichloromaleimides) with 1,3-diphenylisobenzofuran,
Zh. Org. Khim., 1991, 27, 1774-1779. [all data]