Bromazepam-3-hydroxy
- Formula: C14H10BrN3O2
- Molecular weight: 332.152
- IUPAC Standard InChIKey: URRUSNGCYBXNLO-UHFFFAOYSA-N
- CAS Registry Number: 13132-73-5
- Chemical structure:
View 3d structure (requires JavaScript / HTML 5) - Other names: 7-Bromo-3-hydroxy-5-(2-pyridinyl)-1,3-dihydro-2H-1,4-benzodiazepin-2-one; 3-Hydroxybromazepam; 2H-1,4-Benzodiazepin-2-one, 7-bromo-1,3-dihydro-3-hydroxy-5-(2-pyridinyl)-

Kovats' RI, non-polar column, isothermal

Column type | Active phase | Temperature (C) | I | Reference | Comment |
---|---|---|---|---|---|
Packed | SE-30 | 250. | 2540. | Schütz, 1982 | N2 |
Packed | SE-30 | 280. | 2568. | Schütz, 1982 | N2 |
Packed | SE-30 | 250. | 2540. | Schuetz and Westenberger, 1979 | N2, Chromosorb G AW DMCS (80-100 mesh); Column length: 1.5 m |

Normal alkane RI, non-polar column, custom temperature program

Column type | Active phase | I | Reference | Comment |
---|---|---|---|---|
Other | Methyl Silicone | 2555. | Ardrey and Moffat, 1981 | Program: not specified |

References

Schütz, 1982
Schütz, H.,
Benzodiazepines, Springer-Verlag, New York, 1982, 438. [all data]
Schuetz and Westenberger, 1979
Schuetz, H.; Westenberger, V.,
Gas chromatographic data of 31 benzodiazepines and metabolites,
J. Chromatogr., 1979, 169, 409-411, https://doi.org/10.1016/0021-9673(75)85071-0
. [all data]
Ardrey and Moffat, 1981
Ardrey, R.E.; Moffat, A.C.,
Gas-liquid chromatographic retention indices of 1318 substances of toxicological interest on SE-30 or OV-1 stationary phase,
J. Chromatogr., 1981, 220, 3, 195-252, https://doi.org/10.1016/S0021-9673(00)81925-1
. [all data]