1,2,3,4-Tetrahydrodibenzofuran
- Formula: C12H12O
- Molecular weight: 172.2231
- IUPAC Standard InChIKey: LREHXNMBUBVFHA-UHFFFAOYSA-N
- CAS Registry Number: 13130-19-3
- Chemical structure:
View 3d structure (requires JavaScript / HTML 5) - Other names: Dibenzofuran, 1,2,3,4-tetrahydro-

Phase change data

Data compiled by: Robert L. Brown and Stephen E. Stein
Reduced pressure boiling point
Tboil (K) | Pressure (bar) | Reference |
---|---|---|
418. to 419. | 0.020 | Frinton Laboratories Inc., 1986 |

References

Frinton Laboratories Inc., 1986
Frinton Laboratories Inc.,
Catalog Number 11, Frinton Laboratories Inc., Vineland, NJ, 1986, 99. [all data]