Diamyl phthalate

Phase change data

Data compiled as indicated in comments:
AC - William E. Acree, Jr., James S. Chickos
ALS - Hussein Y. Afeefy, Joel F. Liebman, and Stephen E. Stein

Enthalpy of vaporization

ΔvapH (kJ/mol) Temperature (K) Method Reference Comment
99.4318.A,MEStephenson and Malanowski, 1987Based on data from 303. - 500. K. See also Small, Small, et al., 1948.; AC
87.3338.TPerry and Weber, 1949Based on data from 323. - 390. K.; AC
99.2373.VSmall, Small, et al., 1948ALS

Kovats' RI, non-polar column, isothermal

View large format table.

Column type Active phase Temperature (C) I Reference Comment
CapillaryOV-101230.2120.Friocourt, Berthou, et al., 197950. m/0.3 mm/0.35 μm, N2
CapillaryOV-101230.2121.Friocourt, Berthou, et al., 197950. m/0.3 mm/0.35 μm, H2
CapillarySE-30250.2122.Friocourt, Berthou, et al., 197942. m/0.3 mm/0.39 μm, He

Kovats' RI, non-polar column, custom temperature program

View large format table.

Column type Active phase I Reference Comment
PackedSE-302140.Ramsey, Lee, et al., 1980He, Chromosorb G HP (80-100 mesh); Column length: 1.5 m; Program: not specified

Normal alkane RI, non-polar column, temperature ramp

View large format table.

Column type Active phase I Reference Comment
CapillaryOV-1012136.Zenkevich and Ventura, 1991Helium, 50. C @ 0. min, 5. K/min, 240. C @ 0. min; Column length: 54. m; Column diameter: 0.26 mm

Normal alkane RI, non-polar column, custom temperature program

View large format table.

Column type Active phase I Reference Comment
OtherMethyl Silicone2127.Ardrey and Moffat, 1981Program: not specified

References

Stephenson and Malanowski, 1987
Stephenson, Richard M.; Malanowski, Stanislaw, Handbook of the Thermodynamics of Organic Compounds, 1987, https://doi.org/10.1007/978-94-009-3173-2 . [all data]

Small, Small, et al., 1948
Small, P.A.; Small, K.W.; Cowley, P., The vapour pressures of some high boiling esters., Trans. Faraday Soc., 1948, 44, 810. [all data]

Perry and Weber, 1949
Perry, E.S.; Weber, W.H., Vapor Pressures of Phlegmatic Liquids. II. High Molecular Weight Esters and Silicone Oils, J. Am. Chem. Soc., 1949, 71, 11, 3726-3730, https://doi.org/10.1021/ja01179a039 . [all data]