Propane, 1,1,2,2-tetrachloro-
- Formula: C3H4Cl4
- Molecular weight: 181.876
- IUPAC Standard InChIKey: MDCBRXYTSHYYJE-UHFFFAOYSA-N
- CAS Registry Number: 13116-60-4
- Chemical structure:
View 3d structure (requires JavaScript / HTML 5) - Other names: 1,1,2,2-Tetrachloropropane

Phase change data

Data compiled by: Thermodynamics Research Center, NIST Boulder Laboratories, Chris Muzny director
Quantity | Value | Units | Method | Reference | Comment |
---|---|---|---|---|---|
Tboil | 426.15 | K | N/A | Ewell and Welch, 1941 | Uncertainty assigned by TRC = 1.5 K |

References

Ewell and Welch, 1941
Ewell, R.H.; Welch, L.M.,
Maximum Boiling Mixtures of chloroparaffins with Donor Liquids,
J. Am. Chem. Soc., 1941, 63, 2475. [all data]