Propane, 1,2,2,3-tetrachloro-
- Formula: C3H4Cl4
- Molecular weight: 181.876
- IUPAC Standard InChIKey: UDPHJTAYHSSOQB-UHFFFAOYSA-N
- CAS Registry Number: 13116-53-5
- Chemical structure:
View 3d structure (requires JavaScript / HTML 5) - Other names: 1,2,2,3-Tetrachloropropane

Condensed phase thermochemistry data

Data compiled by: Hussein Y. Afeefy, Joel F. Liebman, and Stephen E. Stein
Quantity | Value | Units | Method | Reference | Comment |
---|---|---|---|---|---|
ΔfH°liquid | -252.1 | kJ/mol | Ccr | Hu and Sinke, 1969 | |
Quantity | Value | Units | Method | Reference | Comment |
ΔcH°liquid | -1594.9 | kJ/mol | Ccr | Hu and Sinke, 1969 |

Phase change data

Data compiled as indicated in comments:
BS - Robert L. Brown and Stephen E. Stein
TRC - Thermodynamics Research Center, NIST Boulder Laboratories, Chris Muzny director
AC - William E. Acree, Jr., James S. Chickos
Quantity | Value | Units | Method | Reference | Comment |
---|---|---|---|---|---|
Tboil | 438.2 | K | N/A | Weast and Grasselli, 1989 | BS |
Tboil | 438. | K | N/A | Kirrmann and Kermer, 1948 | Uncertainty assigned by TRC = 4. K; TRC |
Tboil | 437.15 | K | N/A | Ewell and Welch, 1941 | Uncertainty assigned by TRC = 1.5 K; TRC |
Reduced pressure boiling point
Tboil (K) | Pressure (bar) | Reference | Comment |
---|---|---|---|
324.2 | 0.016 | Weast and Grasselli, 1989 | BS |
Enthalpy of vaporization
ΔvapH (kJ/mol) | Temperature (K) | Method | Reference | Comment |
---|---|---|---|---|
42.8 | 361. | A | Stephenson and Malanowski, 1987 | Based on data from 346. to 415. K.; AC |

Normal alkane RI, non-polar column, custom temperature program

Column type | Active phase | I | Reference | Comment |
---|---|---|---|---|
Capillary | OV-1, SE-30, Methyl silicone, SP-2100, OV-101, DB-1, etc. | 963. | Waggott and Davies, 1984 | Hydrogen; Column length: 50. m; Column diameter: 0.32 mm; Program: not specified |

References

Hu and Sinke, 1969
Hu, A.T.; Sinke, G.C.,
Combustion calorimetry of some chlorinated organic compounds,
J. Chem. Thermodyn., 1969, 1, 507-513. [all data]
Weast and Grasselli, 1989
CRC Handbook of Data on Organic Compounds, 2nd Editon, Weast,R.C and Grasselli, J.G., ed(s)., CRC Press, Inc., Boca Raton, FL, 1989, 1. [all data]
Kirrmann and Kermer, 1948
Kirrmann, A.; Kermer, G.,
Bull. Soc. Chim. Fr., 1948, 1948, 166. [all data]
Ewell and Welch, 1941
Ewell, R.H.; Welch, L.M.,
Maximum Boiling Mixtures of chloroparaffins with Donor Liquids,
J. Am. Chem. Soc., 1941, 63, 2475. [all data]
Stephenson and Malanowski, 1987
Stephenson, Richard M.; Malanowski, Stanislaw,
Handbook of the Thermodynamics of Organic Compounds, 1987, https://doi.org/10.1007/978-94-009-3173-2
. [all data]
Waggott and Davies, 1984
Waggott, A.; Davies, I.W.,
Identification of organic pollutants using linear temperature programmed retention indices (LTPRIs) - Part II, 1984, retrieved from http://dwi.defra.gov.uk/research/completed-research/reports/dwi0383.pdf. [all data]