Acetamide, N-hydroxy-N-methyl
- Formula: C3H7NO2
- Molecular weight: 89.0932
- IUPAC Standard InChIKey: BJPJMTMWIVUMAK-UHFFFAOYSA-N
- CAS Registry Number: 13115-24-7
- Chemical structure:
View 3d structure (requires JavaScript / HTML 5) - Permanent link for this species. Use this link for bookmarking this species for future reference.

Reaction thermochemistry data

Data compiled by: John E. Bartmess
Individual Reactions
C3H6NO2- + =
By formula: C3H6NO2- + H+ = C3H7NO2
Quantity | Value | Units | Method | Reference | Comment |
---|---|---|---|---|---|
ΔrH° | 1482. ± 9.6 | kJ/mol | G+TS | Decouzon, Exner, et al., 1990 | gas phase; Acid: N-methyl acetohydroxamic acid |
Quantity | Value | Units | Method | Reference | Comment |
ΔrG° | 1451. ± 8.4 | kJ/mol | IMRE | Decouzon, Exner, et al., 1990 | gas phase; Acid: N-methyl acetohydroxamic acid |

Gas phase ion energetics data

Data evaluated as indicated in comments:
HL - Edward P. Hunter and Sharon G. Lias
Data compiled as indicated in comments:
B - John E. Bartmess
Quantity | Value | Units | Method | Reference | Comment |
---|---|---|---|---|---|
Proton affinity (review) | 876.2 | kJ/mol | N/A | Hunter and Lias, 1998 | HL |
Quantity | Value | Units | Method | Reference | Comment |
Gas basicity | 845.3 | kJ/mol | N/A | Hunter and Lias, 1998 | HL |
De-protonation reactions
C3H6NO2- + =
By formula: C3H6NO2- + H+ = C3H7NO2
Quantity | Value | Units | Method | Reference | Comment |
---|---|---|---|---|---|
ΔrH° | 1482. ± 9.6 | kJ/mol | G+TS | Decouzon, Exner, et al., 1990 | gas phase; Acid: N-methyl acetohydroxamic acid; B |
Quantity | Value | Units | Method | Reference | Comment |
ΔrG° | 1451. ± 8.4 | kJ/mol | IMRE | Decouzon, Exner, et al., 1990 | gas phase; Acid: N-methyl acetohydroxamic acid; B |

References

Decouzon, Exner, et al., 1990
Decouzon, M.; Exner, O.; Gal, J.-F.; Maria, P.-C.,
The Gas-Phase Acidity and the Acidic Site of Acetohydroxamic Acid: an FT-ICR Study,
J. Org. Chem., 1990, 55, 13, 3980, https://doi.org/10.1021/jo00300a007
. [all data]
Hunter and Lias, 1998
Hunter, E.P.; Lias, S.G.,
Evaluated Gas Phase Basicities and Proton Affinities of Molecules: An Update,
J. Phys. Chem. Ref. Data, 1998, 27, 3, 413-656, https://doi.org/10.1063/1.556018
. [all data]