1-Methyl-3,3-diphenylurea
- Formula: C14H14N2O
- Molecular weight: 226.2738
- IUPAC Standard InChIKey: IMFYAZJNDOZIFV-UHFFFAOYSA-N
- CAS Registry Number: 13114-72-2
- Chemical structure:
View 3d structure (requires JavaScript / HTML 5) - Other names: Urea, N'-methyl-N,N-diphenyl-; N,N-Diphenyl-N'-methylurea; 3-methyl-1,1-diphenylurea

Condensed phase thermochemistry data

Data compiled by: Hussein Y. Afeefy, Joel F. Liebman, and Stephen E. Stein
Quantity | Value | Units | Method | Reference | Comment |
---|---|---|---|---|---|
ΔfH°solid | -106.8 ± 7.1 | kJ/mol | Ccb | Medard and Thomas, 1952 | Reanalyzed by Cox and Pilcher, 1970, Original value = -93.3 kJ/mol; Author's hf291_condensed=-29.1 kcal/mol |
Quantity | Value | Units | Method | Reference | Comment |
ΔcH°solid | -7465.1 | kJ/mol | Ccb | Handrick, 1956 | Klein and Schmidt, Unpublished |
ΔcH°solid | -7403.2 ± 7.1 | kJ/mol | Ccb | Medard and Thomas, 1952 | Reanalyzed by Cox and Pilcher, 1970, Original value = -7416.6 kJ/mol; Author's hf291_condensed=-29.1 kcal/mol |

Phase change data

Data compiled by: Thermodynamics Research Center, NIST Boulder Laboratories, Chris Muzny director
Quantity | Value | Units | Method | Reference | Comment |
---|---|---|---|---|---|
Tfus | 444.4 | K | N/A | Medard and Thomas, 1952, 2 | Uncertainty assigned by TRC = 0.00001 K |

References

Medard and Thomas, 1952
Medard, L.; Thomas, M.,
Determination des chaleurs de combustion de douze composes organiques utilises dans les poudres et enplosies,
Mem. Poudres, 1952, 34, 421-442. [all data]
Cox and Pilcher, 1970
Cox, J.D.; Pilcher, G.,
Thermochemistry of Organic and Organometallic Compounds, Academic Press, New York, 1970, 1-636. [all data]
Handrick, 1956
Handrick, G.R.,
Report of the study of pure explosive compounds. Part IV. Calculation of heat of combustion of organic compounds from structural features and calculation of power of high explosives, Rpt. C-58247 for the Office of the Chief of Ordnance, contract DA-19-020-ORD-47 by the Arthur D. Little, Inc., Cambridge, MA, 1956, 467-573. [all data]
Medard and Thomas, 1952, 2
Medard, L.; Thomas, M.,
Meml. Poudres, 1952, 34, 421. [all data]