Androstane-3,17-diol, (3α,5β,17β)-, 2TMS derivative
- Formula: C25H48O2Si2
- Molecular weight: 436.8184
- IUPAC Standard InChIKey: KBSHKNYEUGMMDQ-ZUHJIWNMSA-N
- CAS Registry Number: 13111-26-7
- Chemical structure:
View 3d structure (requires JavaScript / HTML 5) - Stereoisomers:
- Androstane-3,17-diol, (3α,5α,17α)-, 2TMS derivative
- Androstane-3,17-diol, (3α,5α,17β)-, 2TMS derivative
- Androstane-3,17-diol, (3β,5α,17β)-, 2TMS derivative
- Androstane-3,17-diol, (3β,5β,17β)-, 2TMS derivative
- 5-β-Androstan-3-β,17-α-diol, TMS
- 5α-Androstan-3α,17β-diol, TMS
- 5α-Androstane-3β,17β-diol,bis-TMS
- 5β-Androstane-3α,17β-diol,bis-TMS
- 5β-Androstane-3β,17β-diol,bis-TMS
- 5A-Androstane-3B,17A-diol, TMS
- Other names: 3α,17β-Bis(trimethylsilyloxy)-5β-androstane; Silane, [[(3α,5β,17β)-androstane-3,17-diyl]bis(oxy)bis[-trimethyl-; Silane, (5β-androstan-3α,17β-ylenedioxy)bis[trimethyl-; 3,17-Bis[(trimethylsilyl)oxy]androstane, (3α,5β,17β)-; 5-β-Androstan-3-α,17-β-diol, bis-TMS; 5β-Androstanediol-3α,17β, bis-TMS; 5beta-Androstan-3alpha,17beta-diol, bis-TMS; 5-β-Androstan-3-α,17-β-diol, TMS; 5B-Androstane-3A,17B-diol, TMS; 5.beta.-Androstane-3.alpha.,17.beta.-diol, bis(trimethylsilyl) ether; Androstanediol (5A-Androstan-3A,17B-diol), TMS; 5B-Androstan-3A,17B-diol, bis-TMS

Kovats' RI, non-polar column, isothermal

Column type | Active phase | Temperature (C) | I | Reference | Comment |
---|---|---|---|---|---|
Packed | OV-101 | 207. | 2558. | Berthou, Picart, et al., 1976 | Column length: 2.1 m |
Capillary | OV-101 | 252. | 2572. | Berthou, Picart, et al., 1976 | Column length: 55. m; Column diameter: 0.37 mm |
Capillary | OV-101 | 252. | 2572. | Berthou, Picart, et al., 1976 | Column length: 55. m; Column diameter: 0.37 mm |
Packed | OV-1 | 210. | 2550. | Brooks, Thawley, et al., 1971 |

Van Den Dool and Kratz RI, non-polar column, temperature ramp

Column type | Active phase | I | Reference | Comment |
---|---|---|---|---|
Capillary | BP-1 | 2570. | Houghton, Ginn, et al., 1989 | H2, 5. K/min; Column length: 25. m; Column diameter: 0.3 mm; Tstart: 150. C; Tend: 300. C |
Capillary | BP-5 | 2581. | Houghton, Ginn, et al., 1989 | H2, 5. K/min; Column length: 25. m; Column diameter: 0.3 mm; Tstart: 150. C; Tend: 300. C |

Normal alkane RI, non-polar column, temperature ramp

Column type | Active phase | I | Reference | Comment |
---|---|---|---|---|
Packed | SE-30 | 2545. | Harvey, 1977 | N2, Gas Chrom Q, 2. K/min; Column length: 2.0 m; Tstart: 150. C; Tend: 290. C |

Normal alkane RI, non-polar column, custom temperature program

Column type | Active phase | I | Reference | Comment |
---|---|---|---|---|
Capillary | DB-1 | 2567. | Bowers, 1996 | 30. m/0.25 mm/0.25 μm, Helium; Program: 170 0C 20 0C/min -> 260 0C 2.7 0C/min -> 305 0C 20 0C/min -> 320 0C |

References

Berthou, Picart, et al., 1976
Berthou, F.; Picart, D.; Bardou, L.; Floch, H.H.,
Separation of C19 and C21 dihydroxysteroids by open-hole tubular glass columns and lipophilic gel chromatography,
J. Chromatogr., 1976, 118, 2, 135-155, https://doi.org/10.1016/S0021-9673(00)81203-0
. [all data]
Brooks, Thawley, et al., 1971
Brooks, C.J.W.; Thawley, A.R.; Rocher, P.; Middleditch, B.S.; Anthony, G.M.; Stillwell, W.G.,
Characterization of Steroidal Drug Metabolites by Combined Gas Chromatography-Mass Spectrometry,
J. Chromatogr. Sci., 1971, 9, 1, 35-43, https://doi.org/10.1093/chromsci/9.1.35
. [all data]
Houghton, Ginn, et al., 1989
Houghton, E.; Ginn, A.; Teale, P.; Dumasia, M.C.; Copsey, J.,
Comparison of the use of mass spectrometry and methylene unit values in the determination of the stereochemistry of estranediol, the major urinary metabolite of 19-nortestosterone in the horse,
J. Chromatogr., 1989, 479, 73-83, https://doi.org/10.1016/S0021-9673(01)83318-5
. [all data]
Harvey, 1977
Harvey, D.J.,
Allyldimethylsilyl ethers as derivatives for the characterization of steroids and cannabinoids by combined gas chromatography and mass spectrometry,
Biomed. Mass Spectrom., 1977, 4, 4, 265-274, https://doi.org/10.1002/bms.1200040414
. [all data]
Bowers, 1996
Bowers, L.D.,
Separation and confirmation of anabolic steroids with quadrupole ion trap tandem mass spectrometry,
J. Chromatogr. B, 1996, 687, 1, 69-78, https://doi.org/10.1016/S0378-4347(96)00231-9
. [all data]